{"text_format":"1","workbook":"xlsx","n_sheets":19,"sheets":["Look_up","CONTROL","Index","1a","1b","QA","National Overview Chart Data","High Court Raw Data","High Court Chart Data","JP SC Raw Data","FY lookup","Sheriff Court lookup","Internal analytics","2b","Business Trends Chart Data","2","3","4","Sheriffdom Look up"],"not_rendered":{"charts":9,"images":8,"macros":1,"external_links":0,"defined_names":6,"comments":1,"pivot_tables":0},"unopened":[],"bounds":{"document_bytes":16777216,"sheet_cells":100000,"rows_first":2000,"rows_last":500,"rows_between":2000,"halvings":0,"cell_chars":16384,"cell_head_chars":4096},"cells_cut":0,"cells_raw":0,"read":"whole","date_system":"1900"}

{"sheet":"Look_up","index":0,"n_rows":102,"n_cols":5,"rows_kept":102,"cut":false,"hidden":true,"merged":[]}
["Court Code","Court Name","Court Type","Sheriffdom Code","Sheriffdom Name"]
[9701,"ABERDEEN                  ","Sheriff",2,"Grampian Highland & Islands"]
[9702,"AIRDRIE                   ","Sheriff",5,"South Strathclyde, Dumfries & Galloway"]
[9703,"ALLOA                     ","Sheriff",6,"Tayside Central & Fife"]
[9704,"AYR                       ","Sheriff",5,"South Strathclyde, Dumfries & Galloway"]
[9705,"ARBROATH                  ","Sheriff",6,"Tayside Central & Fife"]
[9711,"BANFF                     ","Sheriff",2,"Grampian Highland & Islands"]
[9716,"CAMPBELTOWN               ","Sheriff",4,"North Strathclyde"]
[9717,"CUPAR                     ","Sheriff",6,"Tayside Central & Fife"]
[9721,"DINGWALL                  ","Sheriff",2,"Grampian Highland & Islands"]
[9722,"DORNOCH                   ","Sheriff",2,"Grampian Highland & Islands"]
[9723,"DUMBARTON                 ","Sheriff",4,"North Strathclyde"]
[9724,"DUMFRIES                  ","Sheriff",5,"South Strathclyde, Dumfries & Galloway"]
[9726,"DUNDEE                    ","Sheriff",6,"Tayside Central & Fife"]
[9727,"DUNFERMLINE               ","Sheriff",6,"Tayside Central & Fife"]
[9728,"DUNOON                    ","Sheriff",4,"North Strathclyde"]
[9729,"DUNS                      ","Sheriff",3,"Lothian & Borders"]
[9741,"EDINBURGH                 ","Sheriff",3,"Lothian & Borders"]
[9742,"ELGIN                     ","Sheriff",2,"Grampian Highland & Islands"]
[9751,"FALKIRK                   ","Sheriff",6,"Tayside Central & Fife"]
[9752,"FORFAR                    ","Sheriff",6,"Tayside Central & Fife"]
[9753,"FORT WILLIAM              ","Sheriff",2,"Grampian Highland & Islands"]
[9761,"GLASGOW                   ","Sheriff",1,"Glasgow & Strathkelvin"]
[9762,"GREENOCK                  ","Sheriff",4,"North Strathclyde"]
[9771,"HADDINGTON                ","Sheriff",3,"Lothian & Borders"]
[9772,"HAMILTON                  ","Sheriff",5,"South Strathclyde, Dumfries & Galloway"]
[9781,"INVERNESS                 ","Sheriff",2,"Grampian Highland & Islands"]
[9791,"JEDBURGH                  ","Sheriff",3,"Lothian & Borders"]
[9801,"KILMARNOCK                ","Sheriff",4,"North Strathclyde"]
[9803,"KIRKCALDY                 ","Sheriff",6,"Tayside Central & Fife"]
[9804,"KIRKCUDBRIGHT             ","Sheriff",5,"South Strathclyde, Dumfries & Galloway"]
[9805,"KIRKWALL                  ","Sheriff",2,"Grampian Highland & Islands"]
[9811,"LANARK                    ","Sheriff",5,"South Strathclyde, Dumfries & Galloway"]
[9812,"LERWICK                   ","Sheriff",2,"Grampian Highland & Islands"]
[9814,"LOCHMADDY                 ","Sheriff",2,"Grampian Highland & Islands"]
[9813,"LINLITHGOW                ","Sheriff",null,"Lothian & Borders"]
[9815,"LIVINGSTON                ","Sheriff",null,"Lothian & Borders"]
[9841,"OBAN                      ","Sheriff",4,"North Strathclyde"]
[9851,"PAISLEY                   ","Sheriff",4,"North Strathclyde"]
[9852,"PEEBLES                   ","Sheriff",3,"Lothian & Borders"]
[9853,"PERTH                     ","Sheriff",6,"Tayside Central & Fife"]
[9854,"PETERHEAD                 ","Sheriff",2,"Grampian Highland & Islands"]
[9855,"PORTREE                   ","Sheriff",2,"Grampian Highland & Islands"]
[9861,"ROTHESAY                  ","Sheriff",4,"North Strathclyde"]
[9871,"SELKIRK                   ","Sheriff",3,"Lothian & Borders"]
[9872,"STIRLING                  ","Sheriff",6,"Tayside Central & Fife"]
[9873,"STONEHAVEN                ","Sheriff",2,"Grampian Highland & Islands"]
[9874,"STORNOWAY                 ","Sheriff",2,"Grampian Highland & Islands"]
[9875,"STRANRAER                 ","Sheriff",5,"South Strathclyde, Dumfries & Galloway"]
[9881,"TAIN                      ","Sheriff",2,"Grampian Highland & Islands"]
[9891,"WICK                      ","Sheriff",2,"Grampian Highland & Islands"]
[null,"NATIONAL",null,null,"NATIONAL"]
[9251,"ABERDEEN                  ","JP",2,"Grampian Highland & Islands"]
[9240,"ALLOA                     ","JP",6,"Tayside Central & Fife"]
[9245,"ANNAN                     ","JP",5,"South Strathclyde, Dumfries & Galloway"]
[9263,"ARBROATH                  ","JP",6,"Tayside Central & Fife"]
[9360,"AYR                       ","JP",5,"South Strathclyde, Dumfries & Galloway"]
[9252,"BANFF                     ","JP",2,"Grampian Highland & Islands"]
[9289,"CAMPBELTOWN               ","JP",4,"North Strathclyde"]
[9355,"AIRDRIE                   ","JP",5,"South Strathclyde, Dumfries & Galloway"]
[9356,"CUMBERNAULD               ","JP",5,"South Strathclyde, Dumfries & Galloway"]
[9285,"CUPAR                     ","JP",6,"Tayside Central & Fife"]
[9343,"DINGWALL                  ","JP",2,"Grampian Highland & Islands"]
[9344,"DORNOCH                   ","JP",2,"Grampian Highland & Islands"]
[9376,"DUMBARTON                 ","JP",4,"North Strathclyde"]
[9246,"DUMFRIES                  ","JP",5,"South Strathclyde, Dumfries & Galloway"]
[9256,"DUNDEE                    ","JP",6,"Tayside Central & Fife"]
[9286,"DUNFERMLINE               ","JP",6,"Tayside Central & Fife"]
[9290,"DUNOON                    ","JP",4,"North Strathclyde"]
[9350,"DUNS                      ","JP",3,"Lothian & Borders"]
[9278,"EDINBURGH                 ","JP",3,"Lothian & Borders"]
[9341,"ELGIN                     ","JP",2,"Grampian Highland & Islands"]
[9282,"FALKIRK                   ","JP",6,"Tayside Central & Fife"]
[9264,"FORFAR                    ","JP",6,"Tayside Central & Fife"]
[9345,"FORT WILLIAM              ","JP",2,"Grampian Highland & Islands"]
[9295,"GLASGOW                   ","JP",1,"Glasgow & Strathkelvin"]
[9340,"GREENOCK                  ","JP",4,"North Strathclyde"]
[9270,"HADDINGTON                ","JP",3,"Lothian & Borders"]
[9366,"HAMILTON                  ","JP",5,"South Strathclyde, Dumfries & Galloway"]
[9346,"INVERNESS                 ","JP",2,"Grampian Highland & Islands"]
[9354,"IRVINE                    ","JP",4,"North Strathclyde"]
[9351,"JEDBURGH                  ","JP",3,"Lothian & Borders"]
[9261,"KILMARNOCK                ","JP",4,"North Strathclyde"]
[9287,"KIRKCALDY                 ","JP",6,"Tayside Central & Fife"]
[9247,"KIRKCUDBRIGHT             ","JP",5,"South Strathclyde, Dumfries & Galloway"]
[9367,"LANARK                    ","JP",5,"South Strathclyde, Dumfries & Galloway"]
[9380,"LIVINGSTON                ","JP",3,"Lothian & Borders"]
[9292,"LOCHGILPHEAD              ","JP",4,"North Strathclyde"]
[9357,"MOTHERWELL                ","JP",5,"South Strathclyde, Dumfries & Galloway"]
[9293,"OBAN                      ","JP",4,"North Strathclyde"]
[9342,"PAISLEY                   ","JP",4,"North Strathclyde"]
[9352,"PEEBLES                   ","JP",3,"Lothian & Borders"]
[9358,"PERTH                     ","JP",6,"Tayside Central & Fife"]
[9253,"PETERHEAD                 ","JP",2,"Grampian Highland & Islands"]
[9347,"PORTREE                   ","JP",2,"Grampian Highland & Islands"]
[9353,"SELKIRK                   ","JP",3,"Lothian & Borders"]
[9372,"STIRLING                  ","JP",6,"Tayside Central & Fife"]
[9254,"STONEHAVEN                ","JP",2,"Grampian Highland & Islands"]
[9384,"STORNOWAY                 ","JP",2,"Grampian Highland & Islands"]
[9250,"STRANRAER                 ","JP",5,"South Strathclyde, Dumfries & Galloway"]
[9348,"TAIN                      ","JP",2,"Grampian Highland & Islands"]
[9349,"WICK                      ","JP",2,"Grampian Highland & Islands"]

{"sheet":"CONTROL","index":1,"n_rows":85,"n_cols":18,"rows_kept":85,"cut":false,"hidden":true,"merged":[[4,9,4,10],[1,9,2,10],[6,9,8,10],[17,6,21,8]]}
[]
[null,null,null,null,null,null,null,"Latest month",{"$f":"DATE(I8,I7,1)","v":"2022-12-01"},"DO NOT UPDATE - WILL UPDATE AUTOMATICALLY",null,null,{"$f":"VLOOKUP($I$2,$P$5:$R$85,3,FALSE)","v":"AN"}]
[null,null,null,null,null,null,null,"Month for division",{"$f":"VLOOKUP(I2,P5:Q85,2,FALSE)","v":33}]
[null,null,null,null,null,null,null,null,null,null,null,null,"Month","Number of months in FY",null,"Latest month added","Total number of months"]
[null,null,null,null,null,null,null,"Month in FY",{"$f":"VLOOKUP(I7,M5:N16,2,FALSE)","v":9},"DO NOT UPDATE - WILL UPDATE AUTOMATICALLY",null,null,4,1,null,"2020-04-01",1,"H"]
[null,null,null,null,null,null,null,null,null,null,null,null,5,2,null,"2020-05-01",2,"I"]
[null,null,null,null,null,null,null,"Current month",12,"Update these values as required",null,null,6,3,null,"2020-06-01",3,"J"]
[null,null,null,null,null,null,null,"Current year",2022,null,null,null,7,4,null,"2020-07-01",4,"K"]
[null,null,null,null,null,null,null,"Financial Year","2022-2023",null,null,null,8,5,null,"2020-08-01",5,"L"]
[null,null,null,null,null,null,null,null,null,null,null,null,9,6,null,"2020-09-01",6,"M"]
[null,null,null,null,null,null,null,null,null,null,null,null,10,7,null,"2020-10-01",7,"N"]
[null,null,null,null,null,null,null,null,null,null,null,null,11,8,null,"2020-11-01",8,"O"]
[null,null,null,null,null,null,null,null,null,null,null,null,12,9,null,"2020-12-01",9,"P"]
[null,null,null,null,null,null,null,null,null,null,null,null,1,10,null,"2021-01-01",10,"Q"]
[null,null,null,null,null,null,null,null,null,null,null,null,2,11,null,"2021-02-01",11,"R"]
[null,null,null,null,null,null,null,null,null,null,null,null,3,12,null,"2021-03-01",12,"S"]
[null,null,null,null,null,null,null,null,null,null,null,null,null,null,null,"2021-04-01",13,"T"]
[null,null,null,null,null,null,"Only use this macro button if you have already saved a copy of the original internal version",null,null,null,null,null,null,null,null,"2021-05-01",14,"U"]
[null,null,null,null,null,null,null,null,null,null,null,null,null,null,null,"2021-06-01",15,"V"]
[null,null,null,null,null,null,null,null,null,null,null,null,null,null,null,"2021-07-01",16,"W"]
[null,null,null,null,null,null,null,null,null,null,null,null,null,null,null,"2021-08-01",17,"X"]
[null,null,null,null,null,null,null,null,null,null,null,null,null,null,null,"2021-09-01",18,"Y"]
[null,null,null,null,null,null,null,null,null,null,null,null,null,null,null,"2021-10-01",19,"Z"]
[null,null,null,null,null,null,null,null,null,null,null,null,null,null,null,"2021-11-01",20,"AA"]
[null,null,null,null,null,null,null,null,null,null,null,null,null,null,null,"2021-12-01",21,"AB"]
[null,null,null,null,null,null,null,null,null,null,null,null,null,null,null,"2022-01-01",22,"AC"]
[null,null,null,null,null,null,null,null,null,null,null,null,null,null,null,"2022-02-01",23,"AD"]
[null,null,null,null,null,null,null,null,null,null,null,null,null,null,null,"2022-03-01",24,"AE"]
[null,null,null,null,null,null,null,null,null,null,null,null,null,null,null,"2022-04-01",25,"AF"]
[null,null,null,null,null,null,null,null,null,null,null,null,null,null,null,"2022-05-01",26,"AG"]
[null,null,null,null,null,null,null,null,null,null,null,null,null,null,null,"2022-06-01",27,"AH"]
[null,null,null,null,null,null,null,null,null,null,null,null,null,null,null,"2022-07-01",28,"AI"]
[null,null,null,null,null,null,null,null,null,null,null,null,null,null,null,"2022-08-01",29,"AJ"]
[null,null,null,null,null,null,null,null,null,null,null,null,null,null,null,"2022-09-01",30,"AK"]
[null,null,null,null,null,null,null,null,null,null,null,null,null,null,null,"2022-10-01",31,"AL"]
[null,null,null,null,null,null,null,null,null,null,null,null,null,null,null,"2022-11-01",32,"AM"]
[null,null,null,null,null,null,null,null,null,null,null,null,null,null,null,"2022-12-01",33,"AN"]
[null,null,null,null,null,null,null,null,null,null,null,null,null,null,null,"2023-01-01",34,"AO"]
[null,null,null,null,null,null,null,null,null,null,null,null,null,null,null,"2023-02-01",35,"AP"]
[null,null,null,null,null,null,null,null,null,null,null,null,null,null,null,"2023-03-01",36,"AQ"]
[null,null,null,null,null,null,null,null,null,null,null,null,null,null,null,"2023-04-01",37,"AR"]
[null,null,null,null,null,null,null,null,null,null,null,null,null,null,null,"2023-05-01",38,"AS"]
[null,null,null,null,null,null,null,null,null,null,null,null,null,null,null,"2023-06-01",39,"AT"]
[null,null,null,null,null,null,null,null,null,null,null,null,null,null,null,"2023-07-01",40,"AU"]
[null,null,null,null,null,null,null,null,null,null,null,null,null,null,null,"2023-08-01",41,"AV"]
[null,null,null,null,null,null,null,null,null,null,null,null,null,null,null,"2023-09-01",42,"AW"]
[null,null,null,null,null,null,null,null,null,null,null,null,null,null,null,"2023-10-01",43,"AX"]
[null,null,null,null,null,null,null,null,null,null,null,null,null,null,null,"2023-11-01",44,"AY"]
[null,null,null,null,null,null,null,null,null,null,null,null,null,null,null,"2023-12-01",45,"AZ"]
[null,null,null,null,null,null,null,null,null,null,null,null,null,null,null,"2024-01-01",46,"BA"]
[null,null,null,null,null,null,null,null,null,null,null,null,null,null,null,"2024-02-01",47,"BB"]
[null,null,null,null,null,null,null,null,null,null,null,null,null,null,null,"2024-03-01",48,"BC"]
[null,null,null,null,null,null,null,null,null,null,null,null,null,null,null,"2024-04-01",49,"BD"]
[null,null,null,null,null,null,null,null,null,null,null,null,null,null,null,"2024-05-01",50,"BE"]
[null,null,null,null,null,null,null,null,null,null,null,null,null,null,null,"2024-06-01",51,"BF"]
[null,null,null,null,null,null,null,null,null,null,null,null,null,null,null,"2024-07-01",52,"BG"]
[null,null,null,null,null,null,null,null,null,null,null,null,null,null,null,"2024-08-01",53,"BH"]
[null,null,null,null,null,null,null,null,null,null,null,null,null,null,null,"2024-09-01",54,"BI"]
[null,null,null,null,null,null,null,null,null,null,null,null,null,null,null,"2024-10-01",55,"BJ"]
[null,null,null,null,null,null,null,null,null,null,null,null,null,null,null,"2024-11-01",56,"BK"]
[null,null,null,null,null,null,null,null,null,null,null,null,null,null,null,"2024-12-01",57,"BL"]
[null,null,null,null,null,null,null,null,null,null,null,null,null,null,null,"2025-01-01",58,"BM"]
[null,null,null,null,null,null,null,null,null,null,null,null,null,null,null,"2025-02-01",59,"BN"]
[null,null,null,null,null,null,null,null,null,null,null,null,null,null,null,"2025-03-01",60,"BO"]
[null,null,null,null,null,null,null,null,null,null,null,null,null,null,null,"2025-04-01",61,"BP"]
[null,null,null,null,null,null,null,null,null,null,null,null,null,null,null,"2025-05-01",62,"BQ"]
[null,null,null,null,null,null,null,null,null,null,null,null,null,null,null,"2025-06-01",63,"BR"]
[null,null,null,null,null,null,null,null,null,null,null,null,null,null,null,"2025-07-01",64,"BS"]
[null,null,null,null,null,null,null,null,null,null,null,null,null,null,null,"2025-08-01",65,"BT"]
[null,null,null,null,null,null,null,null,null,null,null,null,null,null,null,"2025-09-01",66,"BU"]
[null,null,null,null,null,null,null,null,null,null,null,null,null,null,null,"2025-10-01",67,"BV"]
[null,null,null,null,null,null,null,null,null,null,null,null,null,null,null,"2025-11-01",68,"BW"]
[null,null,null,null,null,null,null,null,null,null,null,null,null,null,null,"2025-12-01",69,"BX"]
[null,null,null,null,null,null,null,null,null,null,null,null,null,null,null,"2026-01-01",70,"BY"]
[null,null,null,null,null,null,null,null,null,null,null,null,null,null,null,"2026-02-01",71,"BZ"]
[null,null,null,null,null,null,null,null,null,null,null,null,null,null,null,"2026-03-01",72,"CA"]
[null,null,null,null,null,null,null,null,null,null,null,null,null,null,null,"2026-04-01",73,"CB"]
[null,null,null,null,null,null,null,null,null,null,null,null,null,null,null,"2026-05-01",74,"CC"]
[null,null,null,null,null,null,null,null,null,null,null,null,null,null,null,"2026-06-01",75,"CD"]
[null,null,null,null,null,null,null,null,null,null,null,null,null,null,null,"2026-07-01",76,"CE"]
[null,null,null,null,null,null,null,null,null,null,null,null,null,null,null,"2026-08-01",77,"CF"]
[null,null,null,null,null,null,null,null,null,null,null,null,null,null,null,"2026-09-01",78,"CG"]
[null,null,null,null,null,null,null,null,null,null,null,null,null,null,null,"2026-10-01",79,"CH"]
[null,null,null,null,null,null,null,null,null,null,null,null,null,null,null,"2026-11-01",80,"CI"]
[null,null,null,null,null,null,null,null,null,null,null,null,null,null,null,"2026-12-01",81,"CJ"]

{"sheet":"Index","index":2,"n_rows":12,"n_cols":5,"rows_kept":12,"cut":false,"hidden":false,"merged":[[1,0,1,2]]}
[" "]
["Management Information showing interim monthly business volumes and trends for first instance criminal cases calling at Scottish courts during the Coronavirus pandemic. Official Statistics with full commentary are published quarterly."]
[]
["Table","Charts","Description ",null,"Geography"]
[]
["1a","1b","Time series of business volumes ",null,"National data"]
[]
["Worksheet"]
[2," ","Flowcharts showing how criminal cases move through Scotland's courts",null,"N/A"]
[]
[3,null,"Glossary: Explanation of Scottish court terminology",null,"N/A"]
[4,null,"Notes on data and definitions",null,"N/A"]

{"sheet":"1a","index":3,"n_rows":66,"n_cols":40,"rows_kept":66,"cut":false,"hidden":false,"merged":[[0,7,0,8],[65,1,73,2],[4,1,14,1],[41,1,51,1],[53,1,63,1],[0,5,0,6],[3,1,3,2],[16,1,26,1],[28,1,39,1]]}
[null,null,null,null,null,"Back to Index",null,{"$f":"HYPERLINK(\"#\"&\"1a!\"&J1&1,\"Latest Month\")","v":"Latest Month"},null,{"$f":"CONTROL!$M$2","v":"AN"},null,null,null,null,null,null,null,null,null,null,null,null,null,null,null,null,null,null,null,null,null,null,null,null,null,null,null,null,null,"Back to Apr-20"]
[null,null,null,{"$f":"MONTH(D4)","v":4},{"$f":"MONTH(E4)","v":5},6,7,8,9,10,11,12,1,2,3,4,5,6,7,8,9,10,11,12,1,2,3,4,{"$f":"MONTH(AC4)","v":5},6,{"$f":"MONTH(AE4)","v":7},8,{"$f":"MONTH(AG4)","v":9},10,{"$f":"MONTH(AI4)","v":11},12]
[null,null,null,{"$f":"YEAR(D4)","v":2020},{"$f":"YEAR(E4)","v":2020},2020,2020,2020,2020,2020,2020,2020,2021,2021,2021,2021,2021,2021,2021,2021,2021,2021,2021,2021,2022,2022,2022,2022,2022,2022,2022,2022,2022,2022,2022,2022]
[null,"National overview of criminal court cases in Scotland",null,"2020-04-01","2020-05-01","2020-06-01","2020-07-01","2020-08-01","2020-09-01","2020-10-01","2020-11-01","2020-12-01","2021-01-01","2021-02-01","2021-03-01","2021-04-01","2021-05-01","2021-06-01","2021-07-01","2021-08-01","2021-09-01","2021-10-01","2021-11-01","2021-12-01","2022-01-01","2022-02-01","2022-03-01","2022-04-01","2022-05-01","2022-06-01","2022-07-01","2022-08-01","2022-09-01","2022-10-01","2022-11-01","2022-12-01","2022/23 YTD",null,"2019/20","2019/20  monthly average"]
[null,"All Criminal courts","National total of cases registered (not including petitions) ",5306,4561,5720,8558,7643,7333,6903,6050,5858,5703,5465,7560,7505,6909,7136,6743,7214,7124,7166,7399,7235,6894,6233,8009,6814,7686,8043,6869,7664,6234,6476,7701,6060,63547,null,105548,8795.6666666666661]
[null,null,"National total of cases that called at a first hearing",3401,3843,3864,8401,7799,7040,6641,5861,6020,6013,4012,6596,6058,5829,6663,7111,6837,6856,7018,7141,7151,6998,5441,7885,6937,7565,7572,6874,7485,6436,5731,7337,6449,62386,null,100922,8410.1666666666661]
[null,null,"National total of cases that called at a continued first hearing",2023,2320,2724,3896,7105,8751,7686,6799,6372,5434,2421,4453,4541,6260,7980,8583,6724,5455,4575,4610,4377,4252,4621,4249,4570,4601,4195,4455,4279,4378,3620,3727,3893,37718,null,36514,3042.8333333333335]
[null,null,"National total of Section 76 (Solemn business only)",55,60,77,99,108,128,98,92,82,65,84,81,88,108,120,101,105,93,74,97,98,79,113,109,102,101,102,108,126,99,87,105,105,935,null,1142,95.166666666666671]
[null,null,"National total of intermediate diets called (Summary business only)",3402,2356,827,2706,8717,9188,9359,8003,7740,9143,6708,7397,6982,7182,7983,8482,10084,10501,6398,10059,8927,10866,10420,11243,9742,10373,10062,9803,10598,10707,9423,9360,7496,87564,null,89847,7487.25]
[null,null,"National total of trials called ",1019,476,192,355,2811,3950,3980,4386,3868,4882,1200,3101,3167,3649,4577,5062,5917,6778,5449,4420,5882,5648,6472,8276,6556,7431,6820,6134,7457,6901,6897,7273,5307,60776,null,54744,4562]
[null,null,"National total of trials called where evidence was led",5,9,24,84,320,526,575,627,512,276,186,401,470,558,622,583,664,775,626,541,549,536,754,827,691,830,696,620,791,716,775,842,602,6563,null,10121,843.41666666666663]
[null,null,"National total of trials adjourned due to lack of court time",0,0,0,8,24,50,65,63,103,15,10,33,75,92,116,96,130,123,140,94,100,71,121,101,129,139,132,95,152,144,125,167,124,1207,null,1574,131.16666666666666]
[null,null,"Percentage of trials adjourned due to lack of court time",0,0,0,2.2535211267605635E-2,8.5378868729989333E-3,1.2658227848101266E-2,1.6331658291457288E-2,1.4363885088919288E-2,2.6628748707342297E-2,3.0725112658746417E-3,8.3333333333333332E-3,1.0641728474685586E-2,2.3681717713924851E-2,2.5212386955330228E-2,2.5344111863666158E-2,1.8964836033188465E-2,2.1970593206016562E-2,1.8146946001770435E-2,2.5692787667461921E-2,2.1266968325791856E-2,1.7001020061203673E-2,1.2570821529745042E-2,1.869592088998764E-2,1.220396326727888E-2,1.9676632092739475E-2,1.8705423227021935E-2,1.935483870967742E-2,1.5487447016628627E-2,2.0383532251575701E-2,2.0866541081002752E-2,1.8123821951573148E-2,2.2961638938539804E-2,2.3365366497079328E-2,1.9859813084112148E-2,null,2.875200935262312E-2,2.8752009352623117E-2]
[null,null,"National total of cases concluded",586,930,1519,2892,5792,6959,6407,6257,5922,3070,2226,3599,4188,4996,7085,7989,7978,8185,6594,6579,6610,6041,7220,8682,7621,8752,8138,7616,8450,7570,7531,8049,6282,70009,null,93903,7825.25]
[null,null,"National total of trials scheduled at end of period",18074,20236,22437,25900,28351,30956,32427,33590,34283,35067,36037,37801,39488,40882,42451,43341,43526,42550,42756,43597,43016,43606,42503,40923,39958,38499,37174,36184,34734,33594,31562,30588,30305,30305,null,18355,18355]
[null," "]
[null,"High Court ","Indictments registered ",77,85,69,63,46,68,60,32,48,65,64,90,55,43,57,66,37,57,69,54,69,68,90,80,77,70,77,72,82,97,84,84,69,712,null,1024,85.333333333333329]
[null,null,"Indictments called at Preliminary Hearing",12,2,78,172,77,65,60,52,38,47,56,66,69,49,55,35,40,37,59,29,47,64,60,94,99,66,70,80,67,71,88,90,78,709,null,981,81.75]
[null,null,"Indictments called at Continued Preliminary Hearing",5,5,30,76,98,115,97,78,72,87,66,62,62,57,66,57,89,82,63,57,49,49,36,49,48,46,41,44,41,35,45,53,38,391,null,437,36.416666666666664]
[null,null,"Section 76 Indictments",6,6,5,6,5,15,6,9,3,7,11,5,5,4,10,6,7,7,4,7,6,5,8,9,7,9,8,5,15,4,7,6,8,69,null,94,7.833333333333333]
[null,null,"Trials called ",0,0,0,4,14,26,42,58,47,56,67,66,46,60,67,58,74,64,65,81,38,62,64,73,73,87,83,64,82,86,92,79,42,688,null,812,67.666666666666671]
[null,null,"Trials called where evidence was led",0,0,0,4,14,18,28,49,29,43,42,51,34,43,47,48,55,47,54,63,30,47,54,55,50,56,53,42,56,48,51,55,30,441,null,498,41.5]
[null,null,"Trials adjourned due to lack of court time",0,0,0,0,0,0,2,1,9,0,0,0,3,5,3,2,2,1,0,0,0,0,0,4,6,4,3,1,1,2,1,0,2,20,null,49,4.083333333333333]
[null,null,"Percentage of trials adjourned due to lack of court time",0,0,0,0,0,0,4.7619047619047616E-2,1.7241379310344827E-2,0.19148936170212766,0,0,0,6.5217391304347824E-2,8.3333333333333329E-2,4.4776119402985072E-2,3.4482758620689655E-2,2.7027027027027029E-2,1.5625E-2,0,0,0,0,0,5.4794520547945202E-2,8.2191780821917804E-2,4.5977011494252873E-2,3.614457831325301E-2,1.5625E-2,1.2195121951219513E-2,2.3255813953488372E-2,1.0869565217391304E-2,0,4.7619047619047616E-2,2.9069767441860465E-2,null,6.0344827586206899E-2,6.0344827586206885E-2]
[null,null,"Indictments concluded",7,9,14,32,35,20,39,54,54,55,72,64,53,58,62,58,76,62,70,82,56,45,57,77,66,73,74,66,62,69,70,71,54,605,null,806,67.166666666666671]
[null,null,"Average time between pleading diet and evidence led trial, where evidence led trial occurred in the period shown (weeks)",20,"N/A","N/A",21,34,35,50,52,54,52,54,66,58,51,50,55,51,54,50,51,57,62,48,48,49,53,46,46,49,46,52,43,49,49,null,null,22.1]
[null,null,"Trials scheduled at end of period",390,390,390,386,375,360,335,291,250,215,247,267,292,304,313,325,432,385,444,476,516,534,535,560,609,613,613,637,636,641,657,654,698,698,null,390,390]
[]
[null,"Sheriff Court - Solemn business","Petitions registered",641,844,1032,1068,1081,1061,935,890,786,771,896,1071,1011,945,953,989,1059,944,897,1090,848,1025,942,1066,952,984,997,904,1019,913,986,933,822,8510,null,9780,815]
[null,null,"Indictments registered",219,319,355,467,496,494,492,414,428,379,378,410,441,532,471,520,447,481,479,541,450,425,525,447,421,535,439,547,505,460,458,522,435,4322,null,5452,454.33333333333331]
[null,null,"Indictments called at First Diet",311,234,222,322,341,538,467,424,433,464,370,469,432,443,496,468,485,419,450,487,428,481,430,614,450,492,566,532,608,529,491,558,463,4689,null,5114,426.16666666666669]
[null,null,"Indictments called at Continued First Diet",125,127,119,464,486,539,525,724,828,844,868,1017,907,869,898,866,771,730,681,791,564,573,630,687,628,662,511,520,575,527,463,494,364,4744,null,2963,246.91666666666666]
[null,null,"Section 76 indictments",49,54,72,93,103,113,92,83,79,58,73,76,83,104,110,95,98,86,70,90,92,74,105,100,95,92,94,103,111,95,80,99,97,866,null,1048,87.333333333333329]
[null,null,"Trials called  ",91,33,31,37,146,119,73,147,78,161,285,388,362,368,383,340,392,396,393,273,263,368,433,488,425,487,458,426,537,498,548,571,382,4332,null,3142,261.83333333333331]
[null,null,"Trials called where evidence was led",0,0,0,0,0,0,0,0,11,30,56,100,84,82,88,76,83,95,70,48,52,56,78,95,75,94,73,70,93,100,72,117,65,759,null,1134,94.5]
[null,null,"Trials adjourned due to lack of court time",0,0,0,0,0,0,0,0,0,4,9,22,29,30,17,25,23,21,34,18,28,13,24,31,37,54,71,39,51,86,36,43,40,457,null,57,4.75]
[null,null,"Percentage of trials adjourned due to lack of court time",0,0,0,0,0,0,0,0,0,2.4844720496894408E-2,3.1578947368421054E-2,5.6701030927835051E-2,8.0110497237569064E-2,8.1521739130434784E-2,4.4386422976501305E-2,7.3529411764705885E-2,5.8673469387755105E-2,5.3030303030303032E-2,8.6513994910941472E-2,6.5934065934065936E-2,0.10646387832699619,3.5326086956521736E-2,5.5427251732101619E-2,6.3524590163934427E-2,8.7058823529411758E-2,0.11088295687885011,0.15502183406113537,9.154929577464789E-2,9.4972067039106142E-2,0.17269076305220885,6.569343065693431E-2,7.5306479859894915E-2,0.10471204188481675,0.10549399815327794,null,1.8141311266709103E-2,1.8141311266709103E-2]
[null,null,"Indictments concluded",140,127,166,174,284,358,322,276,300,317,354,468,463,442,459,453,451,439,403,414,363,357,427,461,475,458,488,418,524,479,494,484,419,4239,null,5155,429.58333333333331]
[null,null,"Average time between pleading diet and evidence led trial, where evidence led trial occurred in the period shown (weeks)","N/A","N/A","N/A","N/A","N/A","N/A","N/A","N/A",29.975454545454546,32.182999999999993,35.683749999999996,37,38.311309523809513,43.999390243902425,41.658181818181816,41.361184210526318,44.76650602409638,42.948947368421059,41.784857142857149,48.342916666666667,40.551346153846154,40.661607142857143,44.063205128205126,45.251368421052632,40.514266666666671,50.807127659574469,51.62821917808219,44.089571428571432,44.465053763440871,42.515000000000008,40.917083333333331,46.4657264957265,46.27061538461539,46.27061538461539,null,null,11]
[null,null,"Trials scheduled at end of period",497,497,497,497,553,613,648,738,939,1091,1211,1329,1398,1479,1595,1684,1781,1842,1923,2053,2170,2212,2196,2274,2267,2307,2325,2356,2340,2331,2305,2361,2438,2438,null,497,497]
[]
[null,"Sheriff Court -Summary business","Complaints registered",3016,3247,4309,6205,6037,5855,4634,4383,3956,3790,3678,5000,5017,4603,4544,4440,4718,4453,4510,4770,4860,4614,4007,4970,4423,4858,5048,4482,4963,4101,4484,5123,4350,41832,null,65490,5457.5]
[null,null,"Complaints called for first time ",1896,2835,3026,6173,5983,5665,4629,4128,3985,3662,3001,4525,4502,4565,4455,4549,4383,4362,4366,4477,4744,4610,3690,4654,4253,4792,4519,4337,4781,4020,3832,4758,4426,39718,null,61761,5146.75]
[null,null,"Complaints called for 'Continued Without Plea' hearing",899,1252,1675,2216,3243,4258,4078,3231,2951,2376,861,1892,2520,3591,3495,2534,2020,1860,1693,1702,1770,1932,2142,1906,1982,1911,1830,1876,1796,1838,1430,1678,1883,16224,null,14851,1237.5833333333333]
[null,null,"Complaints called in Intermediate Diet court",2702,1910,721,2341,7152,7350,7563,6499,6293,7369,5777,6550,6324,6499,6697,7002,8286,8495,5130,8376,7274,8940,8563,9132,7868,8401,8179,7923,8769,8797,7631,7669,6127,71364,null,70652,5887.666666666667]
[null,null,"Trials called",802,372,154,291,2343,3107,3207,3443,3090,3805,737,2371,2657,3171,3887,4169,4499,5443,4266,3428,4703,4537,5093,6599,5094,5768,5308,4758,5724,5256,5179,5461,4110,46658,null,40729,3394.0833333333335]
[null,null,"Trials called where evidence was led",5,9,24,79,283,440,479,491,399,176,86,250,352,433,471,408,459,551,439,385,422,427,552,604,505,589,495,431,571,474,561,560,437,4623,null,6946,578.83333333333337]
[null,null,"Trials adjourned due to lack of court time",0,0,0,8,21,40,50,57,90,9,1,11,43,57,96,67,91,94,101,68,64,58,88,56,76,70,53,47,89,50,78,111,78,652,null,1230,102.5]
[null,null,"Percentage of trials adjourned due to lack of court time",0,0,0,2.7491408934707903E-2,8.9628681177976958E-3,1.2874155133569359E-2,1.5590894917368257E-2,1.6555329654371186E-2,2.9126213592233011E-2,2.3653088042049934E-3,1.3568521031207597E-3,4.6393926613243356E-3,1.6183665788483251E-2,1.7975402081362345E-2,2.4697710316439414E-2,1.6071000239865674E-2,2.022671704823294E-2,1.726988792945067E-2,2.36755743084857E-2,1.9836639439906652E-2,1.3608335105251966E-2,1.278377782675777E-2,1.7278617710583154E-2,8.4861342627670852E-3,1.49195131527287E-2,1.2135922330097087E-2,9.9849284099472486E-3,9.8781000420344687E-3,1.5548567435359888E-2,9.5129375951293754E-3,1.5060822552616334E-2,2.0325947628639443E-2,1.8978102189781021E-2,1.3974023747267349E-2,null,3.0199612070023817E-2,3.0199612070023814E-2]
[null,null,"Complaints concluded",429,744,1146,2227,4084,4759,4395,4244,3944,2071,1665,2735,3466,4181,4547,4446,4654,5186,4099,4162,4410,4126,4995,5929,4987,5865,5272,4989,5695,5088,5054,5420,4278,46648,null,57256,4771.333333333333]
[null,null,"Average time between pleading diet and evidence led trial, where evidence led trial occurred in the period shown (weeks)",7.0840000000000005,3.8433333333333337,11.475000000000001,21.380506329113924,34.065795053003527,37.83834090909091,35.172505219206677,33.833217922606913,34.112481203007512,36.059147727272737,35.496279069767454,34.892799999999994,34.803607954545448,36.660762124711319,41.735180467091311,44.970416666666679,45.601045751633997,48.230235934664236,47.259476082004547,45.570337662337657,46.96611374407582,49.673278688524583,52.493641304347818,50.45658940397351,52.718000000000004,50.103276740237689,49.937777777777775,44.448329466357315,49.132294220665507,49.651877637130802,46.876844919786095,44.626607142857132,46.496842105263148,46.496842105263148,null,null,23]
[null,null,"Trials scheduled at end of period",13967,15854,17818,20929,22932,25146,26370,27372,27723,28548,29324,30645,31799,32778,33598,33602,33369,32433,32448,33015,32394,32759,31904,30520,29793,28500,27525,26802,25595,24700,23214,22580,22235,22235,null,13971,13971]
[]
[null,"Justice of the Peace Court ","Complaints registered during period",1994,910,987,1823,1064,916,1717,1221,1426,1469,1345,2060,1992,1731,2064,1717,2012,2133,2108,2034,1856,1787,1611,2512,1893,2223,2479,1768,2114,1576,1450,1972,1206,16681,null,33582,2798.5]
[null,null,"Complaints called for first time ",1182,772,538,1734,1398,772,1485,1257,1564,1840,585,1536,1055,772,1657,2059,1929,2038,2143,2148,1932,1843,1261,2523,2135,2215,2417,1925,2029,1816,1320,1931,1482,17270,null,33066,2755.5]
[null,null,"Complaints called for 'Continued Without Plea' hearing",994,936,900,1140,3278,3839,2986,2766,2521,2127,626,1482,1052,1743,3521,5126,3844,2783,2138,2060,1994,1698,1813,1607,1912,1982,1813,2015,1867,1978,1682,1502,1608,16359,null,18263,1521.9166666666667]
[null,null,"Complaints called in Intermediate Diet court",700,446,106,365,1565,1838,1796,1504,1447,1774,931,847,658,683,1286,1480,1798,2006,1268,1683,1653,1926,1857,2111,1874,1972,1883,1880,1829,1910,1792,1691,1369,16200,null,19195,1599.5833333333333]
[null,null,"Trials called",126,71,7,23,308,698,658,738,653,860,111,276,102,50,240,495,952,875,725,638,878,681,882,1116,964,1089,971,886,1114,1061,1078,1162,773,9098,null,10061,838.41666666666663]
[null,null,"Trials called where evidence was led",0,0,0,1,23,68,68,87,73,27,2,0,0,0,16,51,67,82,63,45,45,6,70,73,61,91,75,77,71,94,91,110,70,740,null,1543,128.58333333333334]
[null,null,"Trials adjourned due to lack of court time",0,0,0,0,3,10,13,5,4,2,0,0,0,0,0,2,14,7,5,8,8,0,9,10,10,11,5,8,11,6,10,13,4,78,null,238,19.833333333333332]
[null,null,"Percentage of trials adjourned due to lack of court time",0,0,0,0,9.74025974025974E-3,1.4326647564469915E-2,1.9756838905775075E-2,6.7750677506775072E-3,6.1255742725880554E-3,2.3255813953488372E-3,0,0,0,0,0,4.0404040404040404E-3,1.4705882352941176E-2,8.0000000000000002E-3,6.8965517241379309E-3,1.2539184952978056E-2,9.1116173120728925E-3,0,1.020408163265306E-2,8.9605734767025085E-3,1.0373443983402489E-2,1.0101010101010102E-2,5.1493305870236872E-3,9.0293453724604959E-3,9.8743267504488325E-3,5.6550424128180964E-3,9.2764378478664197E-3,1.1187607573149742E-2,5.1746442432082798E-3,8.5733128160035178E-3,null,2.3655700228605508E-2,2.3655700228605508E-2]
[null,null,"Complaints concluded",10,50,193,459,1389,1822,1651,1683,1624,627,135,332,206,315,2017,3032,2797,2498,2022,1921,1781,1513,1741,2215,2093,2356,2304,2143,2169,1934,1913,2074,1531,18517,null,30686,2557.1666666666665]
[null,null,"Average time between pleading diet and evidence led trial, where evidence led trial occurred in the period shown (weeks)","N/A","N/A","N/A",36.29,34.076956521739127,37.386911764705879,36.722352941176467,41.482298850574708,37.755342465753415,37.104444444444439,54.93,"N/A","N/A","N/A",58.126249999999999,58.448627450980396,58.657164179104484,55.040365853658528,59.379206349206356,59.828888888888883,58.783555555555559,59.025000000000006,56.403428571428563,54.183013698630134,53.937540983606553,56.986263736263744,54.575600000000016,52.053636363636365,47.660845070422546,52.03319148936172,55.113296703296704,52.520545454545456,41.869142857142862,41.869142857142862,null,null,22]
[null,null,"Trials scheduled at end of period",3220,3495,3732,4088,4491,4837,5074,5189,5371,5213,5255,5560,5999,6321,6945,7730,7944,7890,7941,8053,7936,8101,7868,7569,7289,7079,6711,6389,6163,5922,5386,4993,4934,4934,null,3497,3497]
[]
[null,"Notes\n1. These figures provide interim management information during the Coronavirus pandemic. Official Statistics with full commentary will be published by SCTS each quarter as normal. \n2. All figures for 2019/20 are monthly averages except for the rows showing Trials Scheduled and Average time between pleading diet and evidence led trial where figures are as at the end of the period shown.\n"]

{"sheet":"1b","index":4,"n_rows":63,"n_cols":4,"rows_kept":63,"cut":false,"hidden":false,"merged":[[63,3,63,14],[25,28,25,39]]}
[]
[null,"Back to Index"]
[]
[]
[]
[]
[]
[]
[]
[]
[]
[]
[]
[]
[]
[]
[]
[]
[]
[]
[]
[]
[]
[]
[]
[]
[]
[]
[]
[]
[]
[]
[]
[]
[]
[]
[]
[]
[]
[]
[]
[]
[]
[]
[]
[]
[]
[]
[]
[]
[]
[]
[]
[]
[]
[]
[]
[]
[]
[]
[]
[]
[null,null,null,"Notes:"]

{"sheet":"QA","index":5,"n_rows":30,"n_cols":28,"rows_kept":30,"cut":false,"hidden":true,"merged":[[18,0,29,0]]}
[]
["SC Solemn",null,"2020-04-01","2020-05-01","2020-06-01","2020-07-01","2020-08-01","2020-09-01","2020-10-01","2020-11-01","2020-12-01","2021-01-01","2021-02-01","2021-03-01","2021-04-01","2021-05-01","2021-06-01","2021-07-01","2021-08-01","2021-09-01","2021-10-01","2021-11-01","2021-12-01","2022-01-01","2022-02-01","2022-03-01","2022-04-01","2022/23 YTD"]
[null,"Petitions registered",{"$f":"IF('1a'!D29=#REF!,\"MATCH\",\"CHECK\")","v":{"$error":"#REF!"}},{"$f":"IF('1a'!E29=#REF!,\"MATCH\",\"CHECK\")","v":{"$error":"#REF!"}},{"$f":"IF('1a'!F29=#REF!,\"MATCH\",\"CHECK\")","v":{"$error":"#REF!"}},{"$f":"IF('1a'!G29=#REF!,\"MATCH\",\"CHECK\")","v":{"$error":"#REF!"}},{"$f":"IF('1a'!H29=#REF!,\"MATCH\",\"CHECK\")","v":{"$error":"#REF!"}},{"$f":"IF('1a'!I29=#REF!,\"MATCH\",\"CHECK\")","v":{"$error":"#REF!"}},{"$f":"IF('1a'!J29=#REF!,\"MATCH\",\"CHECK\")","v":{"$error":"#REF!"}},{"$f":"IF('1a'!K29=#REF!,\"MATCH\",\"CHECK\")","v":{"$error":"#REF!"}},{"$f":"IF('1a'!L29=#REF!,\"MATCH\",\"CHECK\")","v":{"$error":"#REF!"}},{"$f":"IF('1a'!M29=#REF!,\"MATCH\",\"CHECK\")","v":{"$error":"#REF!"}},{"$f":"IF('1a'!N29=#REF!,\"MATCH\",\"CHECK\")","v":{"$error":"#REF!"}},{"$f":"IF('1a'!O29=#REF!,\"MATCH\",\"CHECK\")","v":{"$error":"#REF!"}},{"$f":"IF('1a'!P29=#REF!,\"MATCH\",\"CHECK\")","v":{"$error":"#REF!"}},{"$f":"IF('1a'!Q29=#REF!,\"MATCH\",\"CHECK\")","v":{"$error":"#REF!"}},{"$f":"IF('1a'!R29=#REF!,\"MATCH\",\"CHECK\")","v":{"$error":"#REF!"}},{"$f":"IF('1a'!S29=#REF!,\"MATCH\",\"CHECK\")","v":{"$error":"#REF!"}},{"$f":"IF('1a'!T29=#REF!,\"MATCH\",\"CHECK\")","v":{"$error":"#REF!"}},{"$f":"IF('1a'!U29=#REF!,\"MATCH\",\"CHECK\")","v":{"$error":"#REF!"}},{"$f":"IF('1a'!V29=#REF!,\"MATCH\",\"CHECK\")","v":{"$error":"#REF!"}},{"$f":"IF('1a'!W29=#REF!,\"MATCH\",\"CHECK\")","v":{"$error":"#REF!"}},{"$f":"IF('1a'!X29=#REF!,\"MATCH\",\"CHECK\")","v":{"$error":"#REF!"}},{"$f":"IF('1a'!Y29=#REF!,\"MATCH\",\"CHECK\")","v":{"$error":"#REF!"}},{"$f":"IF('1a'!Z29=#REF!,\"MATCH\",\"CHECK\")","v":{"$error":"#REF!"}},{"$f":"IF('1a'!AA29=#REF!,\"MATCH\",\"CHECK\")","v":{"$error":"#REF!"}},{"$f":"IF('1a'!AB29=#REF!,\"MATCH\",\"CHECK\")","v":{"$error":"#REF!"}},{"$f":"IF('1a'!AK29=#REF!,\"MATCH\",\"CHECK\")","v":{"$error":"#REF!"}}]
[null,"Indictments registered",{"$f":"IF('1a'!D30=#REF!,\"MATCH\",\"CHECK\")","v":{"$error":"#REF!"}},{"$f":"IF('1a'!E30=#REF!,\"MATCH\",\"CHECK\")","v":{"$error":"#REF!"}},{"$f":"IF('1a'!F30=#REF!,\"MATCH\",\"CHECK\")","v":{"$error":"#REF!"}},{"$f":"IF('1a'!G30=#REF!,\"MATCH\",\"CHECK\")","v":{"$error":"#REF!"}},{"$f":"IF('1a'!H30=#REF!,\"MATCH\",\"CHECK\")","v":{"$error":"#REF!"}},{"$f":"IF('1a'!I30=#REF!,\"MATCH\",\"CHECK\")","v":{"$error":"#REF!"}},{"$f":"IF('1a'!J30=#REF!,\"MATCH\",\"CHECK\")","v":{"$error":"#REF!"}},{"$f":"IF('1a'!K30=#REF!,\"MATCH\",\"CHECK\")","v":{"$error":"#REF!"}},{"$f":"IF('1a'!L30=#REF!,\"MATCH\",\"CHECK\")","v":{"$error":"#REF!"}},{"$f":"IF('1a'!M30=#REF!,\"MATCH\",\"CHECK\")","v":{"$error":"#REF!"}},{"$f":"IF('1a'!N30=#REF!,\"MATCH\",\"CHECK\")","v":{"$error":"#REF!"}},{"$f":"IF('1a'!O30=#REF!,\"MATCH\",\"CHECK\")","v":{"$error":"#REF!"}},{"$f":"IF('1a'!P30=#REF!,\"MATCH\",\"CHECK\")","v":{"$error":"#REF!"}},{"$f":"IF('1a'!Q30=#REF!,\"MATCH\",\"CHECK\")","v":{"$error":"#REF!"}},{"$f":"IF('1a'!R30=#REF!,\"MATCH\",\"CHECK\")","v":{"$error":"#REF!"}},{"$f":"IF('1a'!S30=#REF!,\"MATCH\",\"CHECK\")","v":{"$error":"#REF!"}},{"$f":"IF('1a'!T30=#REF!,\"MATCH\",\"CHECK\")","v":{"$error":"#REF!"}},{"$f":"IF('1a'!U30=#REF!,\"MATCH\",\"CHECK\")","v":{"$error":"#REF!"}},{"$f":"IF('1a'!V30=#REF!,\"MATCH\",\"CHECK\")","v":{"$error":"#REF!"}},{"$f":"IF('1a'!W30=#REF!,\"MATCH\",\"CHECK\")","v":{"$error":"#REF!"}},{"$f":"IF('1a'!X30=#REF!,\"MATCH\",\"CHECK\")","v":{"$error":"#REF!"}},{"$f":"IF('1a'!Y30=#REF!,\"MATCH\",\"CHECK\")","v":{"$error":"#REF!"}},{"$f":"IF('1a'!Z30=#REF!,\"MATCH\",\"CHECK\")","v":{"$error":"#REF!"}},{"$f":"IF('1a'!AA30=#REF!,\"MATCH\",\"CHECK\")","v":{"$error":"#REF!"}},{"$f":"IF('1a'!AB30=#REF!,\"MATCH\",\"CHECK\")","v":{"$error":"#REF!"}},{"$f":"IF('1a'!AK30=#REF!,\"MATCH\",\"CHECK\")","v":{"$error":"#REF!"}}]
[null,"Indictments called at First Diet",{"$f":"IF('1a'!D31=#REF!,\"MATCH\",\"CHECK\")","v":{"$error":"#REF!"}},{"$f":"IF('1a'!E31=#REF!,\"MATCH\",\"CHECK\")","v":{"$error":"#REF!"}},{"$f":"IF('1a'!F31=#REF!,\"MATCH\",\"CHECK\")","v":{"$error":"#REF!"}},{"$f":"IF('1a'!G31=#REF!,\"MATCH\",\"CHECK\")","v":{"$error":"#REF!"}},{"$f":"IF('1a'!H31=#REF!,\"MATCH\",\"CHECK\")","v":{"$error":"#REF!"}},{"$f":"IF('1a'!I31=#REF!,\"MATCH\",\"CHECK\")","v":{"$error":"#REF!"}},{"$f":"IF('1a'!J31=#REF!,\"MATCH\",\"CHECK\")","v":{"$error":"#REF!"}},{"$f":"IF('1a'!K31=#REF!,\"MATCH\",\"CHECK\")","v":{"$error":"#REF!"}},{"$f":"IF('1a'!L31=#REF!,\"MATCH\",\"CHECK\")","v":{"$error":"#REF!"}},{"$f":"IF('1a'!M31=#REF!,\"MATCH\",\"CHECK\")","v":{"$error":"#REF!"}},{"$f":"IF('1a'!N31=#REF!,\"MATCH\",\"CHECK\")","v":{"$error":"#REF!"}},{"$f":"IF('1a'!O31=#REF!,\"MATCH\",\"CHECK\")","v":{"$error":"#REF!"}},{"$f":"IF('1a'!P31=#REF!,\"MATCH\",\"CHECK\")","v":{"$error":"#REF!"}},{"$f":"IF('1a'!Q31=#REF!,\"MATCH\",\"CHECK\")","v":{"$error":"#REF!"}},{"$f":"IF('1a'!R31=#REF!,\"MATCH\",\"CHECK\")","v":{"$error":"#REF!"}},{"$f":"IF('1a'!S31=#REF!,\"MATCH\",\"CHECK\")","v":{"$error":"#REF!"}},{"$f":"IF('1a'!T31=#REF!,\"MATCH\",\"CHECK\")","v":{"$error":"#REF!"}},{"$f":"IF('1a'!U31=#REF!,\"MATCH\",\"CHECK\")","v":{"$error":"#REF!"}},{"$f":"IF('1a'!V31=#REF!,\"MATCH\",\"CHECK\")","v":{"$error":"#REF!"}},{"$f":"IF('1a'!W31=#REF!,\"MATCH\",\"CHECK\")","v":{"$error":"#REF!"}},{"$f":"IF('1a'!X31=#REF!,\"MATCH\",\"CHECK\")","v":{"$error":"#REF!"}},{"$f":"IF('1a'!Y31=#REF!,\"MATCH\",\"CHECK\")","v":{"$error":"#REF!"}},{"$f":"IF('1a'!Z31=#REF!,\"MATCH\",\"CHECK\")","v":{"$error":"#REF!"}},{"$f":"IF('1a'!AA31=#REF!,\"MATCH\",\"CHECK\")","v":{"$error":"#REF!"}},{"$f":"IF('1a'!AB31=#REF!,\"MATCH\",\"CHECK\")","v":{"$error":"#REF!"}},{"$f":"IF('1a'!AK31=#REF!,\"MATCH\",\"CHECK\")","v":{"$error":"#REF!"}}]
[null,"Indictments called at Continued First Diet",{"$f":"IF('1a'!D32=#REF!,\"MATCH\",\"CHECK\")","v":{"$error":"#REF!"}},{"$f":"IF('1a'!E32=#REF!,\"MATCH\",\"CHECK\")","v":{"$error":"#REF!"}},{"$f":"IF('1a'!F32=#REF!,\"MATCH\",\"CHECK\")","v":{"$error":"#REF!"}},{"$f":"IF('1a'!G32=#REF!,\"MATCH\",\"CHECK\")","v":{"$error":"#REF!"}},{"$f":"IF('1a'!H32=#REF!,\"MATCH\",\"CHECK\")","v":{"$error":"#REF!"}},{"$f":"IF('1a'!I32=#REF!,\"MATCH\",\"CHECK\")","v":{"$error":"#REF!"}},{"$f":"IF('1a'!J32=#REF!,\"MATCH\",\"CHECK\")","v":{"$error":"#REF!"}},{"$f":"IF('1a'!K32=#REF!,\"MATCH\",\"CHECK\")","v":{"$error":"#REF!"}},{"$f":"IF('1a'!L32=#REF!,\"MATCH\",\"CHECK\")","v":{"$error":"#REF!"}},{"$f":"IF('1a'!M32=#REF!,\"MATCH\",\"CHECK\")","v":{"$error":"#REF!"}},{"$f":"IF('1a'!N32=#REF!,\"MATCH\",\"CHECK\")","v":{"$error":"#REF!"}},{"$f":"IF('1a'!O32=#REF!,\"MATCH\",\"CHECK\")","v":{"$error":"#REF!"}},{"$f":"IF('1a'!P32=#REF!,\"MATCH\",\"CHECK\")","v":{"$error":"#REF!"}},{"$f":"IF('1a'!Q32=#REF!,\"MATCH\",\"CHECK\")","v":{"$error":"#REF!"}},{"$f":"IF('1a'!R32=#REF!,\"MATCH\",\"CHECK\")","v":{"$error":"#REF!"}},{"$f":"IF('1a'!S32=#REF!,\"MATCH\",\"CHECK\")","v":{"$error":"#REF!"}},{"$f":"IF('1a'!T32=#REF!,\"MATCH\",\"CHECK\")","v":{"$error":"#REF!"}},{"$f":"IF('1a'!U32=#REF!,\"MATCH\",\"CHECK\")","v":{"$error":"#REF!"}},{"$f":"IF('1a'!V32=#REF!,\"MATCH\",\"CHECK\")","v":{"$error":"#REF!"}},{"$f":"IF('1a'!W32=#REF!,\"MATCH\",\"CHECK\")","v":{"$error":"#REF!"}},{"$f":"IF('1a'!X32=#REF!,\"MATCH\",\"CHECK\")","v":{"$error":"#REF!"}},{"$f":"IF('1a'!Y32=#REF!,\"MATCH\",\"CHECK\")","v":{"$error":"#REF!"}},{"$f":"IF('1a'!Z32=#REF!,\"MATCH\",\"CHECK\")","v":{"$error":"#REF!"}},{"$f":"IF('1a'!AA32=#REF!,\"MATCH\",\"CHECK\")","v":{"$error":"#REF!"}},{"$f":"IF('1a'!AB32=#REF!,\"MATCH\",\"CHECK\")","v":{"$error":"#REF!"}},{"$f":"IF('1a'!AK32=#REF!,\"MATCH\",\"CHECK\")","v":{"$error":"#REF!"}}]
[null,"Section 76 indictments",{"$f":"IF('1a'!D33=#REF!,\"MATCH\",\"CHECK\")","v":{"$error":"#REF!"}},{"$f":"IF('1a'!E33=#REF!,\"MATCH\",\"CHECK\")","v":{"$error":"#REF!"}},{"$f":"IF('1a'!F33=#REF!,\"MATCH\",\"CHECK\")","v":{"$error":"#REF!"}},{"$f":"IF('1a'!G33=#REF!,\"MATCH\",\"CHECK\")","v":{"$error":"#REF!"}},{"$f":"IF('1a'!H33=#REF!,\"MATCH\",\"CHECK\")","v":{"$error":"#REF!"}},{"$f":"IF('1a'!I33=#REF!,\"MATCH\",\"CHECK\")","v":{"$error":"#REF!"}},{"$f":"IF('1a'!J33=#REF!,\"MATCH\",\"CHECK\")","v":{"$error":"#REF!"}},{"$f":"IF('1a'!K33=#REF!,\"MATCH\",\"CHECK\")","v":{"$error":"#REF!"}},{"$f":"IF('1a'!L33=#REF!,\"MATCH\",\"CHECK\")","v":{"$error":"#REF!"}},{"$f":"IF('1a'!M33=#REF!,\"MATCH\",\"CHECK\")","v":{"$error":"#REF!"}},{"$f":"IF('1a'!N33=#REF!,\"MATCH\",\"CHECK\")","v":{"$error":"#REF!"}},{"$f":"IF('1a'!O33=#REF!,\"MATCH\",\"CHECK\")","v":{"$error":"#REF!"}},{"$f":"IF('1a'!P33=#REF!,\"MATCH\",\"CHECK\")","v":{"$error":"#REF!"}},{"$f":"IF('1a'!Q33=#REF!,\"MATCH\",\"CHECK\")","v":{"$error":"#REF!"}},{"$f":"IF('1a'!R33=#REF!,\"MATCH\",\"CHECK\")","v":{"$error":"#REF!"}},{"$f":"IF('1a'!S33=#REF!,\"MATCH\",\"CHECK\")","v":{"$error":"#REF!"}},{"$f":"IF('1a'!T33=#REF!,\"MATCH\",\"CHECK\")","v":{"$error":"#REF!"}},{"$f":"IF('1a'!U33=#REF!,\"MATCH\",\"CHECK\")","v":{"$error":"#REF!"}},{"$f":"IF('1a'!V33=#REF!,\"MATCH\",\"CHECK\")","v":{"$error":"#REF!"}},{"$f":"IF('1a'!W33=#REF!,\"MATCH\",\"CHECK\")","v":{"$error":"#REF!"}},{"$f":"IF('1a'!X33=#REF!,\"MATCH\",\"CHECK\")","v":{"$error":"#REF!"}},{"$f":"IF('1a'!Y33=#REF!,\"MATCH\",\"CHECK\")","v":{"$error":"#REF!"}},{"$f":"IF('1a'!Z33=#REF!,\"MATCH\",\"CHECK\")","v":{"$error":"#REF!"}},{"$f":"IF('1a'!AA33=#REF!,\"MATCH\",\"CHECK\")","v":{"$error":"#REF!"}},{"$f":"IF('1a'!AB33=#REF!,\"MATCH\",\"CHECK\")","v":{"$error":"#REF!"}},{"$f":"IF('1a'!AK33=#REF!,\"MATCH\",\"CHECK\")","v":{"$error":"#REF!"}}]
[null,"Trials called  ",{"$f":"IF('1a'!D34=#REF!,\"MATCH\",\"CHECK\")","v":{"$error":"#REF!"}},{"$f":"IF('1a'!E34=#REF!,\"MATCH\",\"CHECK\")","v":{"$error":"#REF!"}},{"$f":"IF('1a'!F34=#REF!,\"MATCH\",\"CHECK\")","v":{"$error":"#REF!"}},{"$f":"IF('1a'!G34=#REF!,\"MATCH\",\"CHECK\")","v":{"$error":"#REF!"}},{"$f":"IF('1a'!H34=#REF!,\"MATCH\",\"CHECK\")","v":{"$error":"#REF!"}},{"$f":"IF('1a'!I34=#REF!,\"MATCH\",\"CHECK\")","v":{"$error":"#REF!"}},{"$f":"IF('1a'!J34=#REF!,\"MATCH\",\"CHECK\")","v":{"$error":"#REF!"}},{"$f":"IF('1a'!K34=#REF!,\"MATCH\",\"CHECK\")","v":{"$error":"#REF!"}},{"$f":"IF('1a'!L34=#REF!,\"MATCH\",\"CHECK\")","v":{"$error":"#REF!"}},{"$f":"IF('1a'!M34=#REF!,\"MATCH\",\"CHECK\")","v":{"$error":"#REF!"}},{"$f":"IF('1a'!N34=#REF!,\"MATCH\",\"CHECK\")","v":{"$error":"#REF!"}},{"$f":"IF('1a'!O34=#REF!,\"MATCH\",\"CHECK\")","v":{"$error":"#REF!"}},{"$f":"IF('1a'!P34=#REF!,\"MATCH\",\"CHECK\")","v":{"$error":"#REF!"}},{"$f":"IF('1a'!Q34=#REF!,\"MATCH\",\"CHECK\")","v":{"$error":"#REF!"}},{"$f":"IF('1a'!R34=#REF!,\"MATCH\",\"CHECK\")","v":{"$error":"#REF!"}},{"$f":"IF('1a'!S34=#REF!,\"MATCH\",\"CHECK\")","v":{"$error":"#REF!"}},{"$f":"IF('1a'!T34=#REF!,\"MATCH\",\"CHECK\")","v":{"$error":"#REF!"}},{"$f":"IF('1a'!U34=#REF!,\"MATCH\",\"CHECK\")","v":{"$error":"#REF!"}},{"$f":"IF('1a'!V34=#REF!,\"MATCH\",\"CHECK\")","v":{"$error":"#REF!"}},{"$f":"IF('1a'!W34=#REF!,\"MATCH\",\"CHECK\")","v":{"$error":"#REF!"}},{"$f":"IF('1a'!X34=#REF!,\"MATCH\",\"CHECK\")","v":{"$error":"#REF!"}},{"$f":"IF('1a'!Y34=#REF!,\"MATCH\",\"CHECK\")","v":{"$error":"#REF!"}},{"$f":"IF('1a'!Z34=#REF!,\"MATCH\",\"CHECK\")","v":{"$error":"#REF!"}},{"$f":"IF('1a'!AA34=#REF!,\"MATCH\",\"CHECK\")","v":{"$error":"#REF!"}},{"$f":"IF('1a'!AB34=#REF!,\"MATCH\",\"CHECK\")","v":{"$error":"#REF!"}},{"$f":"IF('1a'!AK34=#REF!,\"MATCH\",\"CHECK\")","v":{"$error":"#REF!"}}]
[null,"Trials called where evidence was led",{"$f":"IF('1a'!D35=#REF!,\"MATCH\",\"CHECK\")","v":{"$error":"#REF!"}},{"$f":"IF('1a'!E35=#REF!,\"MATCH\",\"CHECK\")","v":{"$error":"#REF!"}},{"$f":"IF('1a'!F35=#REF!,\"MATCH\",\"CHECK\")","v":{"$error":"#REF!"}},{"$f":"IF('1a'!G35=#REF!,\"MATCH\",\"CHECK\")","v":{"$error":"#REF!"}},{"$f":"IF('1a'!H35=#REF!,\"MATCH\",\"CHECK\")","v":{"$error":"#REF!"}},{"$f":"IF('1a'!I35=#REF!,\"MATCH\",\"CHECK\")","v":{"$error":"#REF!"}},{"$f":"IF('1a'!J35=#REF!,\"MATCH\",\"CHECK\")","v":{"$error":"#REF!"}},{"$f":"IF('1a'!K35=#REF!,\"MATCH\",\"CHECK\")","v":{"$error":"#REF!"}},{"$f":"IF('1a'!L35=#REF!,\"MATCH\",\"CHECK\")","v":{"$error":"#REF!"}},{"$f":"IF('1a'!M35=#REF!,\"MATCH\",\"CHECK\")","v":{"$error":"#REF!"}},{"$f":"IF('1a'!N35=#REF!,\"MATCH\",\"CHECK\")","v":{"$error":"#REF!"}},{"$f":"IF('1a'!O35=#REF!,\"MATCH\",\"CHECK\")","v":{"$error":"#REF!"}},{"$f":"IF('1a'!P35=#REF!,\"MATCH\",\"CHECK\")","v":{"$error":"#REF!"}},{"$f":"IF('1a'!Q35=#REF!,\"MATCH\",\"CHECK\")","v":{"$error":"#REF!"}},{"$f":"IF('1a'!R35=#REF!,\"MATCH\",\"CHECK\")","v":{"$error":"#REF!"}},{"$f":"IF('1a'!S35=#REF!,\"MATCH\",\"CHECK\")","v":{"$error":"#REF!"}},{"$f":"IF('1a'!T35=#REF!,\"MATCH\",\"CHECK\")","v":{"$error":"#REF!"}},{"$f":"IF('1a'!U35=#REF!,\"MATCH\",\"CHECK\")","v":{"$error":"#REF!"}},{"$f":"IF('1a'!V35=#REF!,\"MATCH\",\"CHECK\")","v":{"$error":"#REF!"}},{"$f":"IF('1a'!W35=#REF!,\"MATCH\",\"CHECK\")","v":{"$error":"#REF!"}},{"$f":"IF('1a'!X35=#REF!,\"MATCH\",\"CHECK\")","v":{"$error":"#REF!"}},{"$f":"IF('1a'!Y35=#REF!,\"MATCH\",\"CHECK\")","v":{"$error":"#REF!"}},{"$f":"IF('1a'!Z35=#REF!,\"MATCH\",\"CHECK\")","v":{"$error":"#REF!"}},{"$f":"IF('1a'!AA35=#REF!,\"MATCH\",\"CHECK\")","v":{"$error":"#REF!"}},{"$f":"IF('1a'!AB35=#REF!,\"MATCH\",\"CHECK\")","v":{"$error":"#REF!"}},{"$f":"IF('1a'!AK35=#REF!,\"MATCH\",\"CHECK\")","v":{"$error":"#REF!"}}]
[null,"Trials adjourned due to lack of court time",{"$f":"IF('1a'!D36=#REF!,\"MATCH\",\"CHECK\")","v":{"$error":"#REF!"}},{"$f":"IF('1a'!E36=#REF!,\"MATCH\",\"CHECK\")","v":{"$error":"#REF!"}},{"$f":"IF('1a'!F36=#REF!,\"MATCH\",\"CHECK\")","v":{"$error":"#REF!"}},{"$f":"IF('1a'!G36=#REF!,\"MATCH\",\"CHECK\")","v":{"$error":"#REF!"}},{"$f":"IF('1a'!H36=#REF!,\"MATCH\",\"CHECK\")","v":{"$error":"#REF!"}},{"$f":"IF('1a'!I36=#REF!,\"MATCH\",\"CHECK\")","v":{"$error":"#REF!"}},{"$f":"IF('1a'!J36=#REF!,\"MATCH\",\"CHECK\")","v":{"$error":"#REF!"}},{"$f":"IF('1a'!K36=#REF!,\"MATCH\",\"CHECK\")","v":{"$error":"#REF!"}},{"$f":"IF('1a'!L36=#REF!,\"MATCH\",\"CHECK\")","v":{"$error":"#REF!"}},{"$f":"IF('1a'!M36=#REF!,\"MATCH\",\"CHECK\")","v":{"$error":"#REF!"}},{"$f":"IF('1a'!N36=#REF!,\"MATCH\",\"CHECK\")","v":{"$error":"#REF!"}},{"$f":"IF('1a'!O36=#REF!,\"MATCH\",\"CHECK\")","v":{"$error":"#REF!"}},{"$f":"IF('1a'!P36=#REF!,\"MATCH\",\"CHECK\")","v":{"$error":"#REF!"}},{"$f":"IF('1a'!Q36=#REF!,\"MATCH\",\"CHECK\")","v":{"$error":"#REF!"}},{"$f":"IF('1a'!R36=#REF!,\"MATCH\",\"CHECK\")","v":{"$error":"#REF!"}},{"$f":"IF('1a'!S36=#REF!,\"MATCH\",\"CHECK\")","v":{"$error":"#REF!"}},{"$f":"IF('1a'!T36=#REF!,\"MATCH\",\"CHECK\")","v":{"$error":"#REF!"}},{"$f":"IF('1a'!U36=#REF!,\"MATCH\",\"CHECK\")","v":{"$error":"#REF!"}},{"$f":"IF('1a'!V36=#REF!,\"MATCH\",\"CHECK\")","v":{"$error":"#REF!"}},{"$f":"IF('1a'!W36=#REF!,\"MATCH\",\"CHECK\")","v":{"$error":"#REF!"}},{"$f":"IF('1a'!X36=#REF!,\"MATCH\",\"CHECK\")","v":{"$error":"#REF!"}},{"$f":"IF('1a'!Y36=#REF!,\"MATCH\",\"CHECK\")","v":{"$error":"#REF!"}},{"$f":"IF('1a'!Z36=#REF!,\"MATCH\",\"CHECK\")","v":{"$error":"#REF!"}},{"$f":"IF('1a'!AA36=#REF!,\"MATCH\",\"CHECK\")","v":{"$error":"#REF!"}},{"$f":"IF('1a'!AB36=#REF!,\"MATCH\",\"CHECK\")","v":{"$error":"#REF!"}},{"$f":"IF('1a'!AK36=#REF!,\"MATCH\",\"CHECK\")","v":{"$error":"#REF!"}}]
[null,"Percentage of trials adjourned due to lack of court time",{"$f":"IF('1a'!D37=#REF!,\"MATCH\",\"CHECK\")","v":{"$error":"#REF!"}},{"$f":"IF('1a'!E37=#REF!,\"MATCH\",\"CHECK\")","v":{"$error":"#REF!"}},{"$f":"IF('1a'!F37=#REF!,\"MATCH\",\"CHECK\")","v":{"$error":"#REF!"}},{"$f":"IF('1a'!G37=#REF!,\"MATCH\",\"CHECK\")","v":{"$error":"#REF!"}},{"$f":"IF('1a'!H37=#REF!,\"MATCH\",\"CHECK\")","v":{"$error":"#REF!"}},{"$f":"IF('1a'!I37=#REF!,\"MATCH\",\"CHECK\")","v":{"$error":"#REF!"}},{"$f":"IF('1a'!J37=#REF!,\"MATCH\",\"CHECK\")","v":{"$error":"#REF!"}},{"$f":"IF('1a'!K37=#REF!,\"MATCH\",\"CHECK\")","v":{"$error":"#REF!"}},{"$f":"IF('1a'!L37=#REF!,\"MATCH\",\"CHECK\")","v":{"$error":"#REF!"}},{"$f":"IF('1a'!M37=#REF!,\"MATCH\",\"CHECK\")","v":{"$error":"#REF!"}},{"$f":"IF('1a'!N37=#REF!,\"MATCH\",\"CHECK\")","v":{"$error":"#REF!"}},{"$f":"IF('1a'!O37=#REF!,\"MATCH\",\"CHECK\")","v":{"$error":"#REF!"}},{"$f":"IF('1a'!P37=#REF!,\"MATCH\",\"CHECK\")","v":{"$error":"#REF!"}},{"$f":"IF('1a'!Q37=#REF!,\"MATCH\",\"CHECK\")","v":{"$error":"#REF!"}},{"$f":"IF('1a'!R37=#REF!,\"MATCH\",\"CHECK\")","v":{"$error":"#REF!"}},{"$f":"IF('1a'!S37=#REF!,\"MATCH\",\"CHECK\")","v":{"$error":"#REF!"}},{"$f":"IF('1a'!T37=#REF!,\"MATCH\",\"CHECK\")","v":{"$error":"#REF!"}},{"$f":"IF('1a'!U37=#REF!,\"MATCH\",\"CHECK\")","v":{"$error":"#REF!"}},{"$f":"IF('1a'!V37=#REF!,\"MATCH\",\"CHECK\")","v":{"$error":"#REF!"}},{"$f":"IF('1a'!W37=#REF!,\"MATCH\",\"CHECK\")","v":{"$error":"#REF!"}},{"$f":"IF('1a'!X37=#REF!,\"MATCH\",\"CHECK\")","v":{"$error":"#REF!"}},{"$f":"IF('1a'!Y37=#REF!,\"MATCH\",\"CHECK\")","v":{"$error":"#REF!"}},{"$f":"IF('1a'!Z37=#REF!,\"MATCH\",\"CHECK\")","v":{"$error":"#REF!"}},{"$f":"IF('1a'!AA37=#REF!,\"MATCH\",\"CHECK\")","v":{"$error":"#REF!"}},{"$f":"IF('1a'!AB37=#REF!,\"MATCH\",\"CHECK\")","v":{"$error":"#REF!"}},{"$f":"IF('1a'!AK37=#REF!,\"MATCH\",\"CHECK\")","v":{"$error":"#REF!"}}]
[null,"Indictments concluded",{"$f":"IF('1a'!D38=#REF!,\"MATCH\",\"CHECK\")","v":{"$error":"#REF!"}},{"$f":"IF('1a'!E38=#REF!,\"MATCH\",\"CHECK\")","v":{"$error":"#REF!"}},{"$f":"IF('1a'!F38=#REF!,\"MATCH\",\"CHECK\")","v":{"$error":"#REF!"}},{"$f":"IF('1a'!G38=#REF!,\"MATCH\",\"CHECK\")","v":{"$error":"#REF!"}},{"$f":"IF('1a'!H38=#REF!,\"MATCH\",\"CHECK\")","v":{"$error":"#REF!"}},{"$f":"IF('1a'!I38=#REF!,\"MATCH\",\"CHECK\")","v":{"$error":"#REF!"}},{"$f":"IF('1a'!J38=#REF!,\"MATCH\",\"CHECK\")","v":{"$error":"#REF!"}},{"$f":"IF('1a'!K38=#REF!,\"MATCH\",\"CHECK\")","v":{"$error":"#REF!"}},{"$f":"IF('1a'!L38=#REF!,\"MATCH\",\"CHECK\")","v":{"$error":"#REF!"}},{"$f":"IF('1a'!M38=#REF!,\"MATCH\",\"CHECK\")","v":{"$error":"#REF!"}},{"$f":"IF('1a'!N38=#REF!,\"MATCH\",\"CHECK\")","v":{"$error":"#REF!"}},{"$f":"IF('1a'!O38=#REF!,\"MATCH\",\"CHECK\")","v":{"$error":"#REF!"}},{"$f":"IF('1a'!P38=#REF!,\"MATCH\",\"CHECK\")","v":{"$error":"#REF!"}},{"$f":"IF('1a'!Q38=#REF!,\"MATCH\",\"CHECK\")","v":{"$error":"#REF!"}},{"$f":"IF('1a'!R38=#REF!,\"MATCH\",\"CHECK\")","v":{"$error":"#REF!"}},{"$f":"IF('1a'!S38=#REF!,\"MATCH\",\"CHECK\")","v":{"$error":"#REF!"}},{"$f":"IF('1a'!T38=#REF!,\"MATCH\",\"CHECK\")","v":{"$error":"#REF!"}},{"$f":"IF('1a'!U38=#REF!,\"MATCH\",\"CHECK\")","v":{"$error":"#REF!"}},{"$f":"IF('1a'!V38=#REF!,\"MATCH\",\"CHECK\")","v":{"$error":"#REF!"}},{"$f":"IF('1a'!W38=#REF!,\"MATCH\",\"CHECK\")","v":{"$error":"#REF!"}},{"$f":"IF('1a'!X38=#REF!,\"MATCH\",\"CHECK\")","v":{"$error":"#REF!"}},{"$f":"IF('1a'!Y38=#REF!,\"MATCH\",\"CHECK\")","v":{"$error":"#REF!"}},{"$f":"IF('1a'!Z38=#REF!,\"MATCH\",\"CHECK\")","v":{"$error":"#REF!"}},{"$f":"IF('1a'!AA38=#REF!,\"MATCH\",\"CHECK\")","v":{"$error":"#REF!"}},{"$f":"IF('1a'!AB38=#REF!,\"MATCH\",\"CHECK\")","v":{"$error":"#REF!"}},{"$f":"IF('1a'!AK38=#REF!,\"MATCH\",\"CHECK\")","v":{"$error":"#REF!"}}]
[null,"Average time between pleading diet and evidence led trial, where evidence led trial occurred in the period shown (weeks)",{"$f":"IF('1a'!D39=#REF!,\"MATCH\",\"CHECK\")","v":{"$error":"#REF!"}},{"$f":"IF('1a'!E39=#REF!,\"MATCH\",\"CHECK\")","v":{"$error":"#REF!"}},{"$f":"IF('1a'!F39=#REF!,\"MATCH\",\"CHECK\")","v":{"$error":"#REF!"}},{"$f":"IF('1a'!G39=#REF!,\"MATCH\",\"CHECK\")","v":{"$error":"#REF!"}},{"$f":"IF('1a'!H39=#REF!,\"MATCH\",\"CHECK\")","v":{"$error":"#REF!"}},{"$f":"IF('1a'!I39=#REF!,\"MATCH\",\"CHECK\")","v":{"$error":"#REF!"}},{"$f":"IF('1a'!J39=#REF!,\"MATCH\",\"CHECK\")","v":{"$error":"#REF!"}},{"$f":"IF('1a'!K39=#REF!,\"MATCH\",\"CHECK\")","v":{"$error":"#REF!"}},{"$f":"IF('1a'!L39=#REF!,\"MATCH\",\"CHECK\")","v":{"$error":"#REF!"}},{"$f":"IF('1a'!M39=#REF!,\"MATCH\",\"CHECK\")","v":{"$error":"#REF!"}},{"$f":"IF('1a'!N39=#REF!,\"MATCH\",\"CHECK\")","v":{"$error":"#REF!"}},{"$f":"IF('1a'!O39=#REF!,\"MATCH\",\"CHECK\")","v":{"$error":"#REF!"}},{"$f":"IF('1a'!P39=#REF!,\"MATCH\",\"CHECK\")","v":{"$error":"#REF!"}},{"$f":"IF('1a'!Q39=#REF!,\"MATCH\",\"CHECK\")","v":{"$error":"#REF!"}},{"$f":"IF('1a'!R39=#REF!,\"MATCH\",\"CHECK\")","v":{"$error":"#REF!"}},{"$f":"IF('1a'!S39=#REF!,\"MATCH\",\"CHECK\")","v":{"$error":"#REF!"}},{"$f":"IF('1a'!T39=#REF!,\"MATCH\",\"CHECK\")","v":{"$error":"#REF!"}},{"$f":"IF('1a'!U39=#REF!,\"MATCH\",\"CHECK\")","v":{"$error":"#REF!"}},{"$f":"IF('1a'!V39=#REF!,\"MATCH\",\"CHECK\")","v":{"$error":"#REF!"}},{"$f":"IF('1a'!W39=#REF!,\"MATCH\",\"CHECK\")","v":{"$error":"#REF!"}},{"$f":"IF('1a'!X39=#REF!,\"MATCH\",\"CHECK\")","v":{"$error":"#REF!"}},{"$f":"IF('1a'!Y39=#REF!,\"MATCH\",\"CHECK\")","v":{"$error":"#REF!"}},{"$f":"IF('1a'!Z39=#REF!,\"MATCH\",\"CHECK\")","v":{"$error":"#REF!"}},{"$f":"IF('1a'!AA39=#REF!,\"MATCH\",\"CHECK\")","v":{"$error":"#REF!"}},{"$f":"IF('1a'!AB39=#REF!,\"MATCH\",\"CHECK\")","v":{"$error":"#REF!"}},{"$f":"IF('1a'!AK39=#REF!,\"MATCH\",\"CHECK\")","v":{"$error":"#REF!"}}]
[null,"Trials scheduled at end of period",{"$f":"IF('1a'!D40=#REF!,\"MATCH\",\"CHECK\")","v":{"$error":"#REF!"}},{"$f":"IF('1a'!E40=#REF!,\"MATCH\",\"CHECK\")","v":{"$error":"#REF!"}},{"$f":"IF('1a'!F40=#REF!,\"MATCH\",\"CHECK\")","v":{"$error":"#REF!"}},{"$f":"IF('1a'!G40=#REF!,\"MATCH\",\"CHECK\")","v":{"$error":"#REF!"}},{"$f":"IF('1a'!H40=#REF!,\"MATCH\",\"CHECK\")","v":{"$error":"#REF!"}},{"$f":"IF('1a'!I40=#REF!,\"MATCH\",\"CHECK\")","v":{"$error":"#REF!"}},{"$f":"IF('1a'!J40=#REF!,\"MATCH\",\"CHECK\")","v":{"$error":"#REF!"}},{"$f":"IF('1a'!K40=#REF!,\"MATCH\",\"CHECK\")","v":{"$error":"#REF!"}},{"$f":"IF('1a'!L40=#REF!,\"MATCH\",\"CHECK\")","v":{"$error":"#REF!"}},{"$f":"IF('1a'!M40=#REF!,\"MATCH\",\"CHECK\")","v":{"$error":"#REF!"}},{"$f":"IF('1a'!N40=#REF!,\"MATCH\",\"CHECK\")","v":{"$error":"#REF!"}},{"$f":"IF('1a'!O40=#REF!,\"MATCH\",\"CHECK\")","v":{"$error":"#REF!"}},{"$f":"IF('1a'!P40=#REF!,\"MATCH\",\"CHECK\")","v":{"$error":"#REF!"}},{"$f":"IF('1a'!Q40=#REF!,\"MATCH\",\"CHECK\")","v":{"$error":"#REF!"}},{"$f":"IF('1a'!R40=#REF!,\"MATCH\",\"CHECK\")","v":{"$error":"#REF!"}},{"$f":"IF('1a'!S40=#REF!,\"MATCH\",\"CHECK\")","v":{"$error":"#REF!"}},{"$f":"IF('1a'!T40=#REF!,\"MATCH\",\"CHECK\")","v":{"$error":"#REF!"}},{"$f":"IF('1a'!U40=#REF!,\"MATCH\",\"CHECK\")","v":{"$error":"#REF!"}},{"$f":"IF('1a'!V40=#REF!,\"MATCH\",\"CHECK\")","v":{"$error":"#REF!"}},{"$f":"IF('1a'!W40=#REF!,\"MATCH\",\"CHECK\")","v":{"$error":"#REF!"}},{"$f":"IF('1a'!X40=#REF!,\"MATCH\",\"CHECK\")","v":{"$error":"#REF!"}},{"$f":"IF('1a'!Y40=#REF!,\"MATCH\",\"CHECK\")","v":{"$error":"#REF!"}},{"$f":"IF('1a'!Z40=#REF!,\"MATCH\",\"CHECK\")","v":{"$error":"#REF!"}},{"$f":"IF('1a'!AA40=#REF!,\"MATCH\",\"CHECK\")","v":{"$error":"#REF!"}},{"$f":"IF('1a'!AB40=#REF!,\"MATCH\",\"CHECK\")","v":{"$error":"#REF!"}},{"$f":"IF('1a'!AK40=#REF!,\"MATCH\",\"CHECK\")","v":{"$error":"#REF!"}}]
[null,"Forecast Scheduled Trials as at end of period3",{"$f":"IF('1a'!#REF!=#REF!,\"MATCH\",\"CHECK\")","v":{"$error":"#REF!"}},{"$f":"IF('1a'!#REF!=#REF!,\"MATCH\",\"CHECK\")","v":{"$error":"#REF!"}},{"$f":"IF('1a'!#REF!=#REF!,\"MATCH\",\"CHECK\")","v":{"$error":"#REF!"}},{"$f":"IF('1a'!#REF!=#REF!,\"MATCH\",\"CHECK\")","v":{"$error":"#REF!"}},{"$f":"IF('1a'!#REF!=#REF!,\"MATCH\",\"CHECK\")","v":{"$error":"#REF!"}},{"$f":"IF('1a'!#REF!=#REF!,\"MATCH\",\"CHECK\")","v":{"$error":"#REF!"}},{"$f":"IF('1a'!#REF!=#REF!,\"MATCH\",\"CHECK\")","v":{"$error":"#REF!"}},{"$f":"IF('1a'!#REF!=#REF!,\"MATCH\",\"CHECK\")","v":{"$error":"#REF!"}},{"$f":"IF('1a'!#REF!=#REF!,\"MATCH\",\"CHECK\")","v":{"$error":"#REF!"}},{"$f":"IF('1a'!#REF!=#REF!,\"MATCH\",\"CHECK\")","v":{"$error":"#REF!"}},{"$f":"IF('1a'!#REF!=#REF!,\"MATCH\",\"CHECK\")","v":{"$error":"#REF!"}},{"$f":"IF('1a'!#REF!=#REF!,\"MATCH\",\"CHECK\")","v":{"$error":"#REF!"}},{"$f":"IF('1a'!#REF!=#REF!,\"MATCH\",\"CHECK\")","v":{"$error":"#REF!"}},{"$f":"IF('1a'!#REF!=#REF!,\"MATCH\",\"CHECK\")","v":{"$error":"#REF!"}},{"$f":"IF('1a'!#REF!=#REF!,\"MATCH\",\"CHECK\")","v":{"$error":"#REF!"}},{"$f":"IF('1a'!#REF!=#REF!,\"MATCH\",\"CHECK\")","v":{"$error":"#REF!"}},{"$f":"IF('1a'!#REF!=#REF!,\"MATCH\",\"CHECK\")","v":{"$error":"#REF!"}},{"$f":"IF('1a'!#REF!=#REF!,\"MATCH\",\"CHECK\")","v":{"$error":"#REF!"}},{"$f":"IF('1a'!#REF!=#REF!,\"MATCH\",\"CHECK\")","v":{"$error":"#REF!"}},{"$f":"IF('1a'!#REF!=#REF!,\"MATCH\",\"CHECK\")","v":{"$error":"#REF!"}},{"$f":"IF('1a'!#REF!=#REF!,\"MATCH\",\"CHECK\")","v":{"$error":"#REF!"}},{"$f":"IF('1a'!#REF!=#REF!,\"MATCH\",\"CHECK\")","v":{"$error":"#REF!"}},{"$f":"IF('1a'!#REF!=#REF!,\"MATCH\",\"CHECK\")","v":{"$error":"#REF!"}},{"$f":"IF('1a'!#REF!=#REF!,\"MATCH\",\"CHECK\")","v":{"$error":"#REF!"}},{"$f":"IF('1a'!#REF!=#REF!,\"MATCH\",\"CHECK\")","v":{"$error":"#REF!"}}]
[]
[]
["SC summary",null,"2020-04-01","2020-05-01","2020-06-01","2020-07-01","2020-08-01","2020-09-01","2020-10-01","2020-11-01","2020-12-01","2021-01-01","2021-02-01","2021-03-01","2021-04-01","2021-05-01","2021-06-01","2021-07-01","2021-08-01","2021-09-01","2021-10-01","2021-11-01","2021-12-01","2022-01-01","2022-02-01","2022-03-01","2022-04-01","2022/23 YTD"]
["National","Complaints registered",{"$f":"IF('1a'!D42=#REF!,\"MATCH\",\"CHECK\")","v":{"$error":"#REF!"}},{"$f":"IF('1a'!E42=#REF!,\"MATCH\",\"CHECK\")","v":{"$error":"#REF!"}},{"$f":"IF('1a'!F42=#REF!,\"MATCH\",\"CHECK\")","v":{"$error":"#REF!"}},{"$f":"IF('1a'!G42=#REF!,\"MATCH\",\"CHECK\")","v":{"$error":"#REF!"}},{"$f":"IF('1a'!H42=#REF!,\"MATCH\",\"CHECK\")","v":{"$error":"#REF!"}},{"$f":"IF('1a'!I42=#REF!,\"MATCH\",\"CHECK\")","v":{"$error":"#REF!"}},{"$f":"IF('1a'!J42=#REF!,\"MATCH\",\"CHECK\")","v":{"$error":"#REF!"}},{"$f":"IF('1a'!K42=#REF!,\"MATCH\",\"CHECK\")","v":{"$error":"#REF!"}},{"$f":"IF('1a'!L42=#REF!,\"MATCH\",\"CHECK\")","v":{"$error":"#REF!"}},{"$f":"IF('1a'!M42=#REF!,\"MATCH\",\"CHECK\")","v":{"$error":"#REF!"}},{"$f":"IF('1a'!N42=#REF!,\"MATCH\",\"CHECK\")","v":{"$error":"#REF!"}},{"$f":"IF('1a'!O42=#REF!,\"MATCH\",\"CHECK\")","v":{"$error":"#REF!"}},{"$f":"IF('1a'!P42=#REF!,\"MATCH\",\"CHECK\")","v":{"$error":"#REF!"}},{"$f":"IF('1a'!Q42=#REF!,\"MATCH\",\"CHECK\")","v":{"$error":"#REF!"}},{"$f":"IF('1a'!R42=#REF!,\"MATCH\",\"CHECK\")","v":{"$error":"#REF!"}},{"$f":"IF('1a'!S42=#REF!,\"MATCH\",\"CHECK\")","v":{"$error":"#REF!"}},{"$f":"IF('1a'!T42=#REF!,\"MATCH\",\"CHECK\")","v":{"$error":"#REF!"}},{"$f":"IF('1a'!U42=#REF!,\"MATCH\",\"CHECK\")","v":{"$error":"#REF!"}},{"$f":"IF('1a'!V42=#REF!,\"MATCH\",\"CHECK\")","v":{"$error":"#REF!"}},{"$f":"IF('1a'!W42=#REF!,\"MATCH\",\"CHECK\")","v":{"$error":"#REF!"}},{"$f":"IF('1a'!X42=#REF!,\"MATCH\",\"CHECK\")","v":{"$error":"#REF!"}},{"$f":"IF('1a'!Y42=#REF!,\"MATCH\",\"CHECK\")","v":{"$error":"#REF!"}},{"$f":"IF('1a'!Z42=#REF!,\"MATCH\",\"CHECK\")","v":{"$error":"#REF!"}},{"$f":"IF('1a'!AA42=#REF!,\"MATCH\",\"CHECK\")","v":{"$error":"#REF!"}},{"$f":"IF('1a'!AB42=#REF!,\"MATCH\",\"CHECK\")","v":{"$error":"#REF!"}},{"$f":"IF('1a'!AK42=#REF!,\"MATCH\",\"CHECK\")","v":{"$error":"#REF!"}}]
[null,"Complaints called for first time ",{"$f":"IF('1a'!D43=#REF!,\"MATCH\",\"CHECK\")","v":{"$error":"#REF!"}},{"$f":"IF('1a'!E43=#REF!,\"MATCH\",\"CHECK\")","v":{"$error":"#REF!"}},{"$f":"IF('1a'!F43=#REF!,\"MATCH\",\"CHECK\")","v":{"$error":"#REF!"}},{"$f":"IF('1a'!G43=#REF!,\"MATCH\",\"CHECK\")","v":{"$error":"#REF!"}},{"$f":"IF('1a'!H43=#REF!,\"MATCH\",\"CHECK\")","v":{"$error":"#REF!"}},{"$f":"IF('1a'!I43=#REF!,\"MATCH\",\"CHECK\")","v":{"$error":"#REF!"}},{"$f":"IF('1a'!J43=#REF!,\"MATCH\",\"CHECK\")","v":{"$error":"#REF!"}},{"$f":"IF('1a'!K43=#REF!,\"MATCH\",\"CHECK\")","v":{"$error":"#REF!"}},{"$f":"IF('1a'!L43=#REF!,\"MATCH\",\"CHECK\")","v":{"$error":"#REF!"}},{"$f":"IF('1a'!M43=#REF!,\"MATCH\",\"CHECK\")","v":{"$error":"#REF!"}},{"$f":"IF('1a'!N43=#REF!,\"MATCH\",\"CHECK\")","v":{"$error":"#REF!"}},{"$f":"IF('1a'!O43=#REF!,\"MATCH\",\"CHECK\")","v":{"$error":"#REF!"}},{"$f":"IF('1a'!P43=#REF!,\"MATCH\",\"CHECK\")","v":{"$error":"#REF!"}},{"$f":"IF('1a'!Q43=#REF!,\"MATCH\",\"CHECK\")","v":{"$error":"#REF!"}},{"$f":"IF('1a'!R43=#REF!,\"MATCH\",\"CHECK\")","v":{"$error":"#REF!"}},{"$f":"IF('1a'!S43=#REF!,\"MATCH\",\"CHECK\")","v":{"$error":"#REF!"}},{"$f":"IF('1a'!T43=#REF!,\"MATCH\",\"CHECK\")","v":{"$error":"#REF!"}},{"$f":"IF('1a'!U43=#REF!,\"MATCH\",\"CHECK\")","v":{"$error":"#REF!"}},{"$f":"IF('1a'!V43=#REF!,\"MATCH\",\"CHECK\")","v":{"$error":"#REF!"}},{"$f":"IF('1a'!W43=#REF!,\"MATCH\",\"CHECK\")","v":{"$error":"#REF!"}},{"$f":"IF('1a'!X43=#REF!,\"MATCH\",\"CHECK\")","v":{"$error":"#REF!"}},{"$f":"IF('1a'!Y43=#REF!,\"MATCH\",\"CHECK\")","v":{"$error":"#REF!"}},{"$f":"IF('1a'!Z43=#REF!,\"MATCH\",\"CHECK\")","v":{"$error":"#REF!"}},{"$f":"IF('1a'!AA43=#REF!,\"MATCH\",\"CHECK\")","v":{"$error":"#REF!"}},{"$f":"IF('1a'!AB43=#REF!,\"MATCH\",\"CHECK\")","v":{"$error":"#REF!"}},{"$f":"IF('1a'!AK43=#REF!,\"MATCH\",\"CHECK\")","v":{"$error":"#REF!"}}]
[null,"Complaints called for 'Continued Without Plea' hearing",{"$f":"IF('1a'!D44=#REF!,\"MATCH\",\"CHECK\")","v":{"$error":"#REF!"}},{"$f":"IF('1a'!E44=#REF!,\"MATCH\",\"CHECK\")","v":{"$error":"#REF!"}},{"$f":"IF('1a'!F44=#REF!,\"MATCH\",\"CHECK\")","v":{"$error":"#REF!"}},{"$f":"IF('1a'!G44=#REF!,\"MATCH\",\"CHECK\")","v":{"$error":"#REF!"}},{"$f":"IF('1a'!H44=#REF!,\"MATCH\",\"CHECK\")","v":{"$error":"#REF!"}},{"$f":"IF('1a'!I44=#REF!,\"MATCH\",\"CHECK\")","v":{"$error":"#REF!"}},{"$f":"IF('1a'!J44=#REF!,\"MATCH\",\"CHECK\")","v":{"$error":"#REF!"}},{"$f":"IF('1a'!K44=#REF!,\"MATCH\",\"CHECK\")","v":{"$error":"#REF!"}},{"$f":"IF('1a'!L44=#REF!,\"MATCH\",\"CHECK\")","v":{"$error":"#REF!"}},{"$f":"IF('1a'!M44=#REF!,\"MATCH\",\"CHECK\")","v":{"$error":"#REF!"}},{"$f":"IF('1a'!N44=#REF!,\"MATCH\",\"CHECK\")","v":{"$error":"#REF!"}},{"$f":"IF('1a'!O44=#REF!,\"MATCH\",\"CHECK\")","v":{"$error":"#REF!"}},{"$f":"IF('1a'!P44=#REF!,\"MATCH\",\"CHECK\")","v":{"$error":"#REF!"}},{"$f":"IF('1a'!Q44=#REF!,\"MATCH\",\"CHECK\")","v":{"$error":"#REF!"}},{"$f":"IF('1a'!R44=#REF!,\"MATCH\",\"CHECK\")","v":{"$error":"#REF!"}},{"$f":"IF('1a'!S44=#REF!,\"MATCH\",\"CHECK\")","v":{"$error":"#REF!"}},{"$f":"IF('1a'!T44=#REF!,\"MATCH\",\"CHECK\")","v":{"$error":"#REF!"}},{"$f":"IF('1a'!U44=#REF!,\"MATCH\",\"CHECK\")","v":{"$error":"#REF!"}},{"$f":"IF('1a'!V44=#REF!,\"MATCH\",\"CHECK\")","v":{"$error":"#REF!"}},{"$f":"IF('1a'!W44=#REF!,\"MATCH\",\"CHECK\")","v":{"$error":"#REF!"}},{"$f":"IF('1a'!X44=#REF!,\"MATCH\",\"CHECK\")","v":{"$error":"#REF!"}},{"$f":"IF('1a'!Y44=#REF!,\"MATCH\",\"CHECK\")","v":{"$error":"#REF!"}},{"$f":"IF('1a'!Z44=#REF!,\"MATCH\",\"CHECK\")","v":{"$error":"#REF!"}},{"$f":"IF('1a'!AA44=#REF!,\"MATCH\",\"CHECK\")","v":{"$error":"#REF!"}},{"$f":"IF('1a'!AB44=#REF!,\"MATCH\",\"CHECK\")","v":{"$error":"#REF!"}},{"$f":"IF('1a'!AK44=#REF!,\"MATCH\",\"CHECK\")","v":{"$error":"#REF!"}}]
[null,"Complaints called in Intermediate Diet court",{"$f":"IF('1a'!D45=#REF!,\"MATCH\",\"CHECK\")","v":{"$error":"#REF!"}},{"$f":"IF('1a'!E45=#REF!,\"MATCH\",\"CHECK\")","v":{"$error":"#REF!"}},{"$f":"IF('1a'!F45=#REF!,\"MATCH\",\"CHECK\")","v":{"$error":"#REF!"}},{"$f":"IF('1a'!G45=#REF!,\"MATCH\",\"CHECK\")","v":{"$error":"#REF!"}},{"$f":"IF('1a'!H45=#REF!,\"MATCH\",\"CHECK\")","v":{"$error":"#REF!"}},{"$f":"IF('1a'!I45=#REF!,\"MATCH\",\"CHECK\")","v":{"$error":"#REF!"}},{"$f":"IF('1a'!J45=#REF!,\"MATCH\",\"CHECK\")","v":{"$error":"#REF!"}},{"$f":"IF('1a'!K45=#REF!,\"MATCH\",\"CHECK\")","v":{"$error":"#REF!"}},{"$f":"IF('1a'!L45=#REF!,\"MATCH\",\"CHECK\")","v":{"$error":"#REF!"}},{"$f":"IF('1a'!M45=#REF!,\"MATCH\",\"CHECK\")","v":{"$error":"#REF!"}},{"$f":"IF('1a'!N45=#REF!,\"MATCH\",\"CHECK\")","v":{"$error":"#REF!"}},{"$f":"IF('1a'!O45=#REF!,\"MATCH\",\"CHECK\")","v":{"$error":"#REF!"}},{"$f":"IF('1a'!P45=#REF!,\"MATCH\",\"CHECK\")","v":{"$error":"#REF!"}},{"$f":"IF('1a'!Q45=#REF!,\"MATCH\",\"CHECK\")","v":{"$error":"#REF!"}},{"$f":"IF('1a'!R45=#REF!,\"MATCH\",\"CHECK\")","v":{"$error":"#REF!"}},{"$f":"IF('1a'!S45=#REF!,\"MATCH\",\"CHECK\")","v":{"$error":"#REF!"}},{"$f":"IF('1a'!T45=#REF!,\"MATCH\",\"CHECK\")","v":{"$error":"#REF!"}},{"$f":"IF('1a'!U45=#REF!,\"MATCH\",\"CHECK\")","v":{"$error":"#REF!"}},{"$f":"IF('1a'!V45=#REF!,\"MATCH\",\"CHECK\")","v":{"$error":"#REF!"}},{"$f":"IF('1a'!W45=#REF!,\"MATCH\",\"CHECK\")","v":{"$error":"#REF!"}},{"$f":"IF('1a'!X45=#REF!,\"MATCH\",\"CHECK\")","v":{"$error":"#REF!"}},{"$f":"IF('1a'!Y45=#REF!,\"MATCH\",\"CHECK\")","v":{"$error":"#REF!"}},{"$f":"IF('1a'!Z45=#REF!,\"MATCH\",\"CHECK\")","v":{"$error":"#REF!"}},{"$f":"IF('1a'!AA45=#REF!,\"MATCH\",\"CHECK\")","v":{"$error":"#REF!"}},{"$f":"IF('1a'!AB45=#REF!,\"MATCH\",\"CHECK\")","v":{"$error":"#REF!"}},{"$f":"IF('1a'!AK45=#REF!,\"MATCH\",\"CHECK\")","v":{"$error":"#REF!"}}]
[null,"Trials called",{"$f":"IF('1a'!D46=#REF!,\"MATCH\",\"CHECK\")","v":{"$error":"#REF!"}},{"$f":"IF('1a'!E46=#REF!,\"MATCH\",\"CHECK\")","v":{"$error":"#REF!"}},{"$f":"IF('1a'!F46=#REF!,\"MATCH\",\"CHECK\")","v":{"$error":"#REF!"}},{"$f":"IF('1a'!G46=#REF!,\"MATCH\",\"CHECK\")","v":{"$error":"#REF!"}},{"$f":"IF('1a'!H46=#REF!,\"MATCH\",\"CHECK\")","v":{"$error":"#REF!"}},{"$f":"IF('1a'!I46=#REF!,\"MATCH\",\"CHECK\")","v":{"$error":"#REF!"}},{"$f":"IF('1a'!J46=#REF!,\"MATCH\",\"CHECK\")","v":{"$error":"#REF!"}},{"$f":"IF('1a'!K46=#REF!,\"MATCH\",\"CHECK\")","v":{"$error":"#REF!"}},{"$f":"IF('1a'!L46=#REF!,\"MATCH\",\"CHECK\")","v":{"$error":"#REF!"}},{"$f":"IF('1a'!M46=#REF!,\"MATCH\",\"CHECK\")","v":{"$error":"#REF!"}},{"$f":"IF('1a'!N46=#REF!,\"MATCH\",\"CHECK\")","v":{"$error":"#REF!"}},{"$f":"IF('1a'!O46=#REF!,\"MATCH\",\"CHECK\")","v":{"$error":"#REF!"}},{"$f":"IF('1a'!P46=#REF!,\"MATCH\",\"CHECK\")","v":{"$error":"#REF!"}},{"$f":"IF('1a'!Q46=#REF!,\"MATCH\",\"CHECK\")","v":{"$error":"#REF!"}},{"$f":"IF('1a'!R46=#REF!,\"MATCH\",\"CHECK\")","v":{"$error":"#REF!"}},{"$f":"IF('1a'!S46=#REF!,\"MATCH\",\"CHECK\")","v":{"$error":"#REF!"}},{"$f":"IF('1a'!T46=#REF!,\"MATCH\",\"CHECK\")","v":{"$error":"#REF!"}},{"$f":"IF('1a'!U46=#REF!,\"MATCH\",\"CHECK\")","v":{"$error":"#REF!"}},{"$f":"IF('1a'!V46=#REF!,\"MATCH\",\"CHECK\")","v":{"$error":"#REF!"}},{"$f":"IF('1a'!W46=#REF!,\"MATCH\",\"CHECK\")","v":{"$error":"#REF!"}},{"$f":"IF('1a'!X46=#REF!,\"MATCH\",\"CHECK\")","v":{"$error":"#REF!"}},{"$f":"IF('1a'!Y46=#REF!,\"MATCH\",\"CHECK\")","v":{"$error":"#REF!"}},{"$f":"IF('1a'!Z46=#REF!,\"MATCH\",\"CHECK\")","v":{"$error":"#REF!"}},{"$f":"IF('1a'!AA46=#REF!,\"MATCH\",\"CHECK\")","v":{"$error":"#REF!"}},{"$f":"IF('1a'!AB46=#REF!,\"MATCH\",\"CHECK\")","v":{"$error":"#REF!"}},{"$f":"IF('1a'!AK46=#REF!,\"MATCH\",\"CHECK\")","v":{"$error":"#REF!"}}]
[null,"Trials called where evidence was led",{"$f":"IF('1a'!D47=#REF!,\"MATCH\",\"CHECK\")","v":{"$error":"#REF!"}},{"$f":"IF('1a'!E47=#REF!,\"MATCH\",\"CHECK\")","v":{"$error":"#REF!"}},{"$f":"IF('1a'!F47=#REF!,\"MATCH\",\"CHECK\")","v":{"$error":"#REF!"}},{"$f":"IF('1a'!G47=#REF!,\"MATCH\",\"CHECK\")","v":{"$error":"#REF!"}},{"$f":"IF('1a'!H47=#REF!,\"MATCH\",\"CHECK\")","v":{"$error":"#REF!"}},{"$f":"IF('1a'!I47=#REF!,\"MATCH\",\"CHECK\")","v":{"$error":"#REF!"}},{"$f":"IF('1a'!J47=#REF!,\"MATCH\",\"CHECK\")","v":{"$error":"#REF!"}},{"$f":"IF('1a'!K47=#REF!,\"MATCH\",\"CHECK\")","v":{"$error":"#REF!"}},{"$f":"IF('1a'!L47=#REF!,\"MATCH\",\"CHECK\")","v":{"$error":"#REF!"}},{"$f":"IF('1a'!M47=#REF!,\"MATCH\",\"CHECK\")","v":{"$error":"#REF!"}},{"$f":"IF('1a'!N47=#REF!,\"MATCH\",\"CHECK\")","v":{"$error":"#REF!"}},{"$f":"IF('1a'!O47=#REF!,\"MATCH\",\"CHECK\")","v":{"$error":"#REF!"}},{"$f":"IF('1a'!P47=#REF!,\"MATCH\",\"CHECK\")","v":{"$error":"#REF!"}},{"$f":"IF('1a'!Q47=#REF!,\"MATCH\",\"CHECK\")","v":{"$error":"#REF!"}},{"$f":"IF('1a'!R47=#REF!,\"MATCH\",\"CHECK\")","v":{"$error":"#REF!"}},{"$f":"IF('1a'!S47=#REF!,\"MATCH\",\"CHECK\")","v":{"$error":"#REF!"}},{"$f":"IF('1a'!T47=#REF!,\"MATCH\",\"CHECK\")","v":{"$error":"#REF!"}},{"$f":"IF('1a'!U47=#REF!,\"MATCH\",\"CHECK\")","v":{"$error":"#REF!"}},{"$f":"IF('1a'!V47=#REF!,\"MATCH\",\"CHECK\")","v":{"$error":"#REF!"}},{"$f":"IF('1a'!W47=#REF!,\"MATCH\",\"CHECK\")","v":{"$error":"#REF!"}},{"$f":"IF('1a'!X47=#REF!,\"MATCH\",\"CHECK\")","v":{"$error":"#REF!"}},{"$f":"IF('1a'!Y47=#REF!,\"MATCH\",\"CHECK\")","v":{"$error":"#REF!"}},{"$f":"IF('1a'!Z47=#REF!,\"MATCH\",\"CHECK\")","v":{"$error":"#REF!"}},{"$f":"IF('1a'!AA47=#REF!,\"MATCH\",\"CHECK\")","v":{"$error":"#REF!"}},{"$f":"IF('1a'!AB47=#REF!,\"MATCH\",\"CHECK\")","v":{"$error":"#REF!"}},{"$f":"IF('1a'!AK47=#REF!,\"MATCH\",\"CHECK\")","v":{"$error":"#REF!"}}]
[null,"Trials adjourned due to lack of court time",{"$f":"IF('1a'!D48=#REF!,\"MATCH\",\"CHECK\")","v":{"$error":"#REF!"}},{"$f":"IF('1a'!E48=#REF!,\"MATCH\",\"CHECK\")","v":{"$error":"#REF!"}},{"$f":"IF('1a'!F48=#REF!,\"MATCH\",\"CHECK\")","v":{"$error":"#REF!"}},{"$f":"IF('1a'!G48=#REF!,\"MATCH\",\"CHECK\")","v":{"$error":"#REF!"}},{"$f":"IF('1a'!H48=#REF!,\"MATCH\",\"CHECK\")","v":{"$error":"#REF!"}},{"$f":"IF('1a'!I48=#REF!,\"MATCH\",\"CHECK\")","v":{"$error":"#REF!"}},{"$f":"IF('1a'!J48=#REF!,\"MATCH\",\"CHECK\")","v":{"$error":"#REF!"}},{"$f":"IF('1a'!K48=#REF!,\"MATCH\",\"CHECK\")","v":{"$error":"#REF!"}},{"$f":"IF('1a'!L48=#REF!,\"MATCH\",\"CHECK\")","v":{"$error":"#REF!"}},{"$f":"IF('1a'!M48=#REF!,\"MATCH\",\"CHECK\")","v":{"$error":"#REF!"}},{"$f":"IF('1a'!N48=#REF!,\"MATCH\",\"CHECK\")","v":{"$error":"#REF!"}},{"$f":"IF('1a'!O48=#REF!,\"MATCH\",\"CHECK\")","v":{"$error":"#REF!"}},{"$f":"IF('1a'!P48=#REF!,\"MATCH\",\"CHECK\")","v":{"$error":"#REF!"}},{"$f":"IF('1a'!Q48=#REF!,\"MATCH\",\"CHECK\")","v":{"$error":"#REF!"}},{"$f":"IF('1a'!R48=#REF!,\"MATCH\",\"CHECK\")","v":{"$error":"#REF!"}},{"$f":"IF('1a'!S48=#REF!,\"MATCH\",\"CHECK\")","v":{"$error":"#REF!"}},{"$f":"IF('1a'!T48=#REF!,\"MATCH\",\"CHECK\")","v":{"$error":"#REF!"}},{"$f":"IF('1a'!U48=#REF!,\"MATCH\",\"CHECK\")","v":{"$error":"#REF!"}},{"$f":"IF('1a'!V48=#REF!,\"MATCH\",\"CHECK\")","v":{"$error":"#REF!"}},{"$f":"IF('1a'!W48=#REF!,\"MATCH\",\"CHECK\")","v":{"$error":"#REF!"}},{"$f":"IF('1a'!X48=#REF!,\"MATCH\",\"CHECK\")","v":{"$error":"#REF!"}},{"$f":"IF('1a'!Y48=#REF!,\"MATCH\",\"CHECK\")","v":{"$error":"#REF!"}},{"$f":"IF('1a'!Z48=#REF!,\"MATCH\",\"CHECK\")","v":{"$error":"#REF!"}},{"$f":"IF('1a'!AA48=#REF!,\"MATCH\",\"CHECK\")","v":{"$error":"#REF!"}},{"$f":"IF('1a'!AB48=#REF!,\"MATCH\",\"CHECK\")","v":{"$error":"#REF!"}},{"$f":"IF('1a'!AK48=#REF!,\"MATCH\",\"CHECK\")","v":{"$error":"#REF!"}}]
[null,"Percentage of trials adjourned due to lack of court time",{"$f":"IF('1a'!D49=#REF!,\"MATCH\",\"CHECK\")","v":{"$error":"#REF!"}},{"$f":"IF('1a'!E49=#REF!,\"MATCH\",\"CHECK\")","v":{"$error":"#REF!"}},{"$f":"IF('1a'!F49=#REF!,\"MATCH\",\"CHECK\")","v":{"$error":"#REF!"}},{"$f":"IF('1a'!G49=#REF!,\"MATCH\",\"CHECK\")","v":{"$error":"#REF!"}},{"$f":"IF('1a'!H49=#REF!,\"MATCH\",\"CHECK\")","v":{"$error":"#REF!"}},{"$f":"IF('1a'!I49=#REF!,\"MATCH\",\"CHECK\")","v":{"$error":"#REF!"}},{"$f":"IF('1a'!J49=#REF!,\"MATCH\",\"CHECK\")","v":{"$error":"#REF!"}},{"$f":"IF('1a'!K49=#REF!,\"MATCH\",\"CHECK\")","v":{"$error":"#REF!"}},{"$f":"IF('1a'!L49=#REF!,\"MATCH\",\"CHECK\")","v":{"$error":"#REF!"}},{"$f":"IF('1a'!M49=#REF!,\"MATCH\",\"CHECK\")","v":{"$error":"#REF!"}},{"$f":"IF('1a'!N49=#REF!,\"MATCH\",\"CHECK\")","v":{"$error":"#REF!"}},{"$f":"IF('1a'!O49=#REF!,\"MATCH\",\"CHECK\")","v":{"$error":"#REF!"}},{"$f":"IF('1a'!P49=#REF!,\"MATCH\",\"CHECK\")","v":{"$error":"#REF!"}},{"$f":"IF('1a'!Q49=#REF!,\"MATCH\",\"CHECK\")","v":{"$error":"#REF!"}},{"$f":"IF('1a'!R49=#REF!,\"MATCH\",\"CHECK\")","v":{"$error":"#REF!"}},{"$f":"IF('1a'!S49=#REF!,\"MATCH\",\"CHECK\")","v":{"$error":"#REF!"}},{"$f":"IF('1a'!T49=#REF!,\"MATCH\",\"CHECK\")","v":{"$error":"#REF!"}},{"$f":"IF('1a'!U49=#REF!,\"MATCH\",\"CHECK\")","v":{"$error":"#REF!"}},{"$f":"IF('1a'!V49=#REF!,\"MATCH\",\"CHECK\")","v":{"$error":"#REF!"}},{"$f":"IF('1a'!W49=#REF!,\"MATCH\",\"CHECK\")","v":{"$error":"#REF!"}},{"$f":"IF('1a'!X49=#REF!,\"MATCH\",\"CHECK\")","v":{"$error":"#REF!"}},{"$f":"IF('1a'!Y49=#REF!,\"MATCH\",\"CHECK\")","v":{"$error":"#REF!"}},{"$f":"IF('1a'!Z49=#REF!,\"MATCH\",\"CHECK\")","v":{"$error":"#REF!"}},{"$f":"IF('1a'!AA49=#REF!,\"MATCH\",\"CHECK\")","v":{"$error":"#REF!"}},{"$f":"IF('1a'!AB49=#REF!,\"MATCH\",\"CHECK\")","v":{"$error":"#REF!"}},{"$f":"IF('1a'!AK49=#REF!,\"MATCH\",\"CHECK\")","v":{"$error":"#REF!"}}]
[null,"Complaints concluded",{"$f":"IF('1a'!D50=#REF!,\"MATCH\",\"CHECK\")","v":{"$error":"#REF!"}},{"$f":"IF('1a'!E50=#REF!,\"MATCH\",\"CHECK\")","v":{"$error":"#REF!"}},{"$f":"IF('1a'!F50=#REF!,\"MATCH\",\"CHECK\")","v":{"$error":"#REF!"}},{"$f":"IF('1a'!G50=#REF!,\"MATCH\",\"CHECK\")","v":{"$error":"#REF!"}},{"$f":"IF('1a'!H50=#REF!,\"MATCH\",\"CHECK\")","v":{"$error":"#REF!"}},{"$f":"IF('1a'!I50=#REF!,\"MATCH\",\"CHECK\")","v":{"$error":"#REF!"}},{"$f":"IF('1a'!J50=#REF!,\"MATCH\",\"CHECK\")","v":{"$error":"#REF!"}},{"$f":"IF('1a'!K50=#REF!,\"MATCH\",\"CHECK\")","v":{"$error":"#REF!"}},{"$f":"IF('1a'!L50=#REF!,\"MATCH\",\"CHECK\")","v":{"$error":"#REF!"}},{"$f":"IF('1a'!M50=#REF!,\"MATCH\",\"CHECK\")","v":{"$error":"#REF!"}},{"$f":"IF('1a'!N50=#REF!,\"MATCH\",\"CHECK\")","v":{"$error":"#REF!"}},{"$f":"IF('1a'!O50=#REF!,\"MATCH\",\"CHECK\")","v":{"$error":"#REF!"}},{"$f":"IF('1a'!P50=#REF!,\"MATCH\",\"CHECK\")","v":{"$error":"#REF!"}},{"$f":"IF('1a'!Q50=#REF!,\"MATCH\",\"CHECK\")","v":{"$error":"#REF!"}},{"$f":"IF('1a'!R50=#REF!,\"MATCH\",\"CHECK\")","v":{"$error":"#REF!"}},{"$f":"IF('1a'!S50=#REF!,\"MATCH\",\"CHECK\")","v":{"$error":"#REF!"}},{"$f":"IF('1a'!T50=#REF!,\"MATCH\",\"CHECK\")","v":{"$error":"#REF!"}},{"$f":"IF('1a'!U50=#REF!,\"MATCH\",\"CHECK\")","v":{"$error":"#REF!"}},{"$f":"IF('1a'!V50=#REF!,\"MATCH\",\"CHECK\")","v":{"$error":"#REF!"}},{"$f":"IF('1a'!W50=#REF!,\"MATCH\",\"CHECK\")","v":{"$error":"#REF!"}},{"$f":"IF('1a'!X50=#REF!,\"MATCH\",\"CHECK\")","v":{"$error":"#REF!"}},{"$f":"IF('1a'!Y50=#REF!,\"MATCH\",\"CHECK\")","v":{"$error":"#REF!"}},{"$f":"IF('1a'!Z50=#REF!,\"MATCH\",\"CHECK\")","v":{"$error":"#REF!"}},{"$f":"IF('1a'!AA50=#REF!,\"MATCH\",\"CHECK\")","v":{"$error":"#REF!"}},{"$f":"IF('1a'!AB50=#REF!,\"MATCH\",\"CHECK\")","v":{"$error":"#REF!"}},{"$f":"IF('1a'!AK50=#REF!,\"MATCH\",\"CHECK\")","v":{"$error":"#REF!"}}]
[null,"Average time between pleading diet and evidence led trial, where evidence led trial occurred in the period shown (weeks)",{"$f":"IF('1a'!D51=#REF!,\"MATCH\",\"CHECK\")","v":{"$error":"#REF!"}},{"$f":"IF('1a'!E51=#REF!,\"MATCH\",\"CHECK\")","v":{"$error":"#REF!"}},{"$f":"IF('1a'!F51=#REF!,\"MATCH\",\"CHECK\")","v":{"$error":"#REF!"}},{"$f":"IF('1a'!G51=#REF!,\"MATCH\",\"CHECK\")","v":{"$error":"#REF!"}},{"$f":"IF('1a'!H51=#REF!,\"MATCH\",\"CHECK\")","v":{"$error":"#REF!"}},{"$f":"IF('1a'!I51=#REF!,\"MATCH\",\"CHECK\")","v":{"$error":"#REF!"}},{"$f":"IF('1a'!J51=#REF!,\"MATCH\",\"CHECK\")","v":{"$error":"#REF!"}},{"$f":"IF('1a'!K51=#REF!,\"MATCH\",\"CHECK\")","v":{"$error":"#REF!"}},{"$f":"IF('1a'!L51=#REF!,\"MATCH\",\"CHECK\")","v":{"$error":"#REF!"}},{"$f":"IF('1a'!M51=#REF!,\"MATCH\",\"CHECK\")","v":{"$error":"#REF!"}},{"$f":"IF('1a'!N51=#REF!,\"MATCH\",\"CHECK\")","v":{"$error":"#REF!"}},{"$f":"IF('1a'!O51=#REF!,\"MATCH\",\"CHECK\")","v":{"$error":"#REF!"}},{"$f":"IF('1a'!P51=#REF!,\"MATCH\",\"CHECK\")","v":{"$error":"#REF!"}},{"$f":"IF('1a'!Q51=#REF!,\"MATCH\",\"CHECK\")","v":{"$error":"#REF!"}},{"$f":"IF('1a'!R51=#REF!,\"MATCH\",\"CHECK\")","v":{"$error":"#REF!"}},{"$f":"IF('1a'!S51=#REF!,\"MATCH\",\"CHECK\")","v":{"$error":"#REF!"}},{"$f":"IF('1a'!T51=#REF!,\"MATCH\",\"CHECK\")","v":{"$error":"#REF!"}},{"$f":"IF('1a'!U51=#REF!,\"MATCH\",\"CHECK\")","v":{"$error":"#REF!"}},{"$f":"IF('1a'!V51=#REF!,\"MATCH\",\"CHECK\")","v":{"$error":"#REF!"}},{"$f":"IF('1a'!W51=#REF!,\"MATCH\",\"CHECK\")","v":{"$error":"#REF!"}},{"$f":"IF('1a'!X51=#REF!,\"MATCH\",\"CHECK\")","v":{"$error":"#REF!"}},{"$f":"IF('1a'!Y51=#REF!,\"MATCH\",\"CHECK\")","v":{"$error":"#REF!"}},{"$f":"IF('1a'!Z51=#REF!,\"MATCH\",\"CHECK\")","v":{"$error":"#REF!"}},{"$f":"IF('1a'!AA51=#REF!,\"MATCH\",\"CHECK\")","v":{"$error":"#REF!"}},{"$f":"IF('1a'!AB51=#REF!,\"MATCH\",\"CHECK\")","v":{"$error":"#REF!"}},{"$f":"IF('1a'!AK51=#REF!,\"MATCH\",\"CHECK\")","v":{"$error":"#REF!"}}]
[null,"Trials scheduled at end of period",{"$f":"IF('1a'!D52=#REF!,\"MATCH\",\"CHECK\")","v":{"$error":"#REF!"}},{"$f":"IF('1a'!E52=#REF!,\"MATCH\",\"CHECK\")","v":{"$error":"#REF!"}},{"$f":"IF('1a'!F52=#REF!,\"MATCH\",\"CHECK\")","v":{"$error":"#REF!"}},{"$f":"IF('1a'!G52=#REF!,\"MATCH\",\"CHECK\")","v":{"$error":"#REF!"}},{"$f":"IF('1a'!H52=#REF!,\"MATCH\",\"CHECK\")","v":{"$error":"#REF!"}},{"$f":"IF('1a'!I52=#REF!,\"MATCH\",\"CHECK\")","v":{"$error":"#REF!"}},{"$f":"IF('1a'!J52=#REF!,\"MATCH\",\"CHECK\")","v":{"$error":"#REF!"}},{"$f":"IF('1a'!K52=#REF!,\"MATCH\",\"CHECK\")","v":{"$error":"#REF!"}},{"$f":"IF('1a'!L52=#REF!,\"MATCH\",\"CHECK\")","v":{"$error":"#REF!"}},{"$f":"IF('1a'!M52=#REF!,\"MATCH\",\"CHECK\")","v":{"$error":"#REF!"}},{"$f":"IF('1a'!N52=#REF!,\"MATCH\",\"CHECK\")","v":{"$error":"#REF!"}},{"$f":"IF('1a'!O52=#REF!,\"MATCH\",\"CHECK\")","v":{"$error":"#REF!"}},{"$f":"IF('1a'!P52=#REF!,\"MATCH\",\"CHECK\")","v":{"$error":"#REF!"}},{"$f":"IF('1a'!Q52=#REF!,\"MATCH\",\"CHECK\")","v":{"$error":"#REF!"}},{"$f":"IF('1a'!R52=#REF!,\"MATCH\",\"CHECK\")","v":{"$error":"#REF!"}},{"$f":"IF('1a'!S52=#REF!,\"MATCH\",\"CHECK\")","v":{"$error":"#REF!"}},{"$f":"IF('1a'!T52=#REF!,\"MATCH\",\"CHECK\")","v":{"$error":"#REF!"}},{"$f":"IF('1a'!U52=#REF!,\"MATCH\",\"CHECK\")","v":{"$error":"#REF!"}},{"$f":"IF('1a'!V52=#REF!,\"MATCH\",\"CHECK\")","v":{"$error":"#REF!"}},{"$f":"IF('1a'!W52=#REF!,\"MATCH\",\"CHECK\")","v":{"$error":"#REF!"}},{"$f":"IF('1a'!X52=#REF!,\"MATCH\",\"CHECK\")","v":{"$error":"#REF!"}},{"$f":"IF('1a'!Y52=#REF!,\"MATCH\",\"CHECK\")","v":{"$error":"#REF!"}},{"$f":"IF('1a'!Z52=#REF!,\"MATCH\",\"CHECK\")","v":{"$error":"#REF!"}},{"$f":"IF('1a'!AA52=#REF!,\"MATCH\",\"CHECK\")","v":{"$error":"#REF!"}},{"$f":"IF('1a'!AB52=#REF!,\"MATCH\",\"CHECK\")","v":{"$error":"#REF!"}},{"$f":"IF('1a'!AK52=#REF!,\"MATCH\",\"CHECK\")","v":{"$error":"#REF!"}}]
[null,"Forecast Scheduled Trials as at end of period3",{"$f":"IF('1a'!#REF!=#REF!,\"MATCH\",\"CHECK\")","v":{"$error":"#REF!"}},{"$f":"IF('1a'!#REF!=#REF!,\"MATCH\",\"CHECK\")","v":{"$error":"#REF!"}},{"$f":"IF('1a'!#REF!=#REF!,\"MATCH\",\"CHECK\")","v":{"$error":"#REF!"}},{"$f":"IF('1a'!#REF!=#REF!,\"MATCH\",\"CHECK\")","v":{"$error":"#REF!"}},{"$f":"IF('1a'!#REF!=#REF!,\"MATCH\",\"CHECK\")","v":{"$error":"#REF!"}},{"$f":"IF('1a'!#REF!=#REF!,\"MATCH\",\"CHECK\")","v":{"$error":"#REF!"}},{"$f":"IF('1a'!#REF!=#REF!,\"MATCH\",\"CHECK\")","v":{"$error":"#REF!"}},{"$f":"IF('1a'!#REF!=#REF!,\"MATCH\",\"CHECK\")","v":{"$error":"#REF!"}},{"$f":"IF('1a'!#REF!=#REF!,\"MATCH\",\"CHECK\")","v":{"$error":"#REF!"}},{"$f":"IF('1a'!#REF!=#REF!,\"MATCH\",\"CHECK\")","v":{"$error":"#REF!"}},{"$f":"IF('1a'!#REF!=#REF!,\"MATCH\",\"CHECK\")","v":{"$error":"#REF!"}},{"$f":"IF('1a'!#REF!=#REF!,\"MATCH\",\"CHECK\")","v":{"$error":"#REF!"}},{"$f":"IF('1a'!#REF!=#REF!,\"MATCH\",\"CHECK\")","v":{"$error":"#REF!"}},{"$f":"IF('1a'!#REF!=#REF!,\"MATCH\",\"CHECK\")","v":{"$error":"#REF!"}},{"$f":"IF('1a'!#REF!=#REF!,\"MATCH\",\"CHECK\")","v":{"$error":"#REF!"}},{"$f":"IF('1a'!#REF!=#REF!,\"MATCH\",\"CHECK\")","v":{"$error":"#REF!"}},{"$f":"IF('1a'!#REF!=#REF!,\"MATCH\",\"CHECK\")","v":{"$error":"#REF!"}},{"$f":"IF('1a'!#REF!=#REF!,\"MATCH\",\"CHECK\")","v":{"$error":"#REF!"}},{"$f":"IF('1a'!#REF!=#REF!,\"MATCH\",\"CHECK\")","v":{"$error":"#REF!"}},{"$f":"IF('1a'!#REF!=#REF!,\"MATCH\",\"CHECK\")","v":{"$error":"#REF!"}},{"$f":"IF('1a'!#REF!=#REF!,\"MATCH\",\"CHECK\")","v":{"$error":"#REF!"}},{"$f":"IF('1a'!#REF!=#REF!,\"MATCH\",\"CHECK\")","v":{"$error":"#REF!"}},{"$f":"IF('1a'!#REF!=#REF!,\"MATCH\",\"CHECK\")","v":{"$error":"#REF!"}},{"$f":"IF('1a'!#REF!=#REF!,\"MATCH\",\"CHECK\")","v":{"$error":"#REF!"}},{"$f":"IF('1a'!#REF!=#REF!,\"MATCH\",\"CHECK\")","v":{"$error":"#REF!"}}]

{"sheet":"National Overview Chart Data","index":6,"n_rows":68,"n_cols":36,"rows_kept":68,"cut":false,"hidden":true,"merged":[[67,0,69,0]]}
["National overview chart data"]
[]
["Cases Registered",{"$f":"'1a'!D4","v":"2020-04-01"},{"$f":"'1a'!E4","v":"2020-05-01"},{"$f":"'1a'!F4","v":"2020-06-01"},{"$f":"'1a'!G4","v":"2020-07-01"},{"$f":"'1a'!H4","v":"2020-08-01"},{"$f":"'1a'!I4","v":"2020-09-01"},{"$f":"'1a'!J4","v":"2020-10-01"},{"$f":"'1a'!K4","v":"2020-11-01"},{"$f":"'1a'!L4","v":"2020-12-01"},{"$f":"'1a'!M4","v":"2021-01-01"},{"$f":"'1a'!N4","v":"2021-02-01"},{"$f":"'1a'!O4","v":"2021-03-01"},{"$f":"'1a'!P4","v":"2021-04-01"},{"$f":"'1a'!Q4","v":"2021-05-01"},{"$f":"'1a'!R4","v":"2021-06-01"},{"$f":"'1a'!S4","v":"2021-07-01"},{"$f":"'1a'!T4","v":"2021-08-01"},{"$f":"'1a'!U4","v":"2021-09-01"},{"$f":"'1a'!V4","v":"2021-10-01"},{"$f":"'1a'!W4","v":"2021-11-01"},{"$f":"'1a'!X4","v":"2021-12-01"},{"$f":"'1a'!Y4","v":"2022-01-01"},{"$f":"'1a'!Z4","v":"2022-02-01"},{"$f":"'1a'!AA4","v":"2022-03-01"},{"$f":"'1a'!AB4","v":"2022-04-01"},{"$f":"'1a'!AC4","v":"2022-05-01"},{"$f":"'1a'!AD4","v":"2022-06-01"},{"$f":"'1a'!AE4","v":"2022-07-01"},{"$f":"'1a'!AF4","v":"2022-08-01"},{"$f":"'1a'!AG4","v":"2022-09-01"},{"$f":"'1a'!AH4","v":"2022-10-01"},{"$f":"'1a'!AI4","v":"2022-11-01"},{"$f":"'1a'!AJ4","v":"2022-12-01"},"2019/20 monthly average","2020/21 YTD"]
["National",{"$f":"'1a'!D5","v":5306},{"$f":"'1a'!E5","v":4561},{"$f":"'1a'!F5","v":5720},{"$f":"'1a'!G5","v":8558},{"$f":"'1a'!H5","v":7643},{"$f":"'1a'!I5","v":7333},{"$f":"'1a'!J5","v":6903},{"$f":"'1a'!K5","v":6050},{"$f":"'1a'!L5","v":5858},{"$f":"'1a'!M5","v":5703},{"$f":"'1a'!N5","v":5465},{"$f":"'1a'!O5","v":7560},{"$f":"'1a'!P5","v":7505},{"$f":"'1a'!Q5","v":6909},{"$f":"'1a'!R5","v":7136},{"$f":"'1a'!S5","v":6743},{"$f":"'1a'!T5","v":7214},{"$f":"'1a'!U5","v":7124},{"$f":"'1a'!V5","v":7166},{"$f":"'1a'!W5","v":7399},{"$f":"'1a'!X5","v":7235},{"$f":"'1a'!Y5","v":6894},{"$f":"'1a'!Z5","v":6233},{"$f":"'1a'!AA5","v":8009},{"$f":"'1a'!AB5","v":6814},{"$f":"'1a'!AC5","v":7686},{"$f":"'1a'!AD5","v":8043},{"$f":"'1a'!AE5","v":6869},{"$f":"'1a'!AF5","v":7664},{"$f":"'1a'!AG5","v":6234},{"$f":"'1a'!AH5","v":6476},{"$f":"'1a'!AI5","v":7701},{"$f":"'1a'!AJ5","v":6060},{"$f":"'1a'!AN5","v":8795.6666666666661}]
["High Court",{"$f":"'1a'!D17","v":77},{"$f":"'1a'!E17","v":85},{"$f":"'1a'!F17","v":69},{"$f":"'1a'!G17","v":63},{"$f":"'1a'!H17","v":46},{"$f":"'1a'!I17","v":68},{"$f":"'1a'!J17","v":60},{"$f":"'1a'!K17","v":32},{"$f":"'1a'!L17","v":48},{"$f":"'1a'!M17","v":65},{"$f":"'1a'!N17","v":64},{"$f":"'1a'!O17","v":90},{"$f":"'1a'!P17","v":55},{"$f":"'1a'!Q17","v":43},{"$f":"'1a'!R17","v":57},{"$f":"'1a'!S17","v":66},{"$f":"'1a'!T17","v":37},{"$f":"'1a'!U17","v":57},{"$f":"'1a'!V17","v":69},{"$f":"'1a'!W17","v":54},{"$f":"'1a'!X17","v":69},{"$f":"'1a'!Y17","v":68},{"$f":"'1a'!Z17","v":90},{"$f":"'1a'!AA17","v":80},{"$f":"'1a'!AB17","v":77},{"$f":"'1a'!AC17","v":70},{"$f":"'1a'!AD17","v":77},{"$f":"'1a'!AE17","v":72},{"$f":"'1a'!AF17","v":82},{"$f":"'1a'!AG17","v":97},{"$f":"'1a'!AH17","v":84},{"$f":"'1a'!AI17","v":84},{"$f":"'1a'!AJ17","v":69},{"$f":"'1a'!AN17","v":85.333333333333329}]
["Sheriff Court - Solemn",{"$f":"'1a'!D30","v":219},{"$f":"'1a'!E30","v":319},{"$f":"'1a'!F30","v":355},{"$f":"'1a'!G30","v":467},{"$f":"'1a'!H30","v":496},{"$f":"'1a'!I30","v":494},{"$f":"'1a'!J30","v":492},{"$f":"'1a'!K30","v":414},{"$f":"'1a'!L30","v":428},{"$f":"'1a'!M30","v":379},{"$f":"'1a'!N30","v":378},{"$f":"'1a'!O30","v":410},{"$f":"'1a'!P30","v":441},{"$f":"'1a'!Q30","v":532},{"$f":"'1a'!R30","v":471},{"$f":"'1a'!S30","v":520},{"$f":"'1a'!T30","v":447},{"$f":"'1a'!U30","v":481},{"$f":"'1a'!V30","v":479},{"$f":"'1a'!W30","v":541},{"$f":"'1a'!X30","v":450},{"$f":"'1a'!Y30","v":425},{"$f":"'1a'!Z30","v":525},{"$f":"'1a'!AA30","v":447},{"$f":"'1a'!AB30","v":421},{"$f":"'1a'!AC30","v":535},{"$f":"'1a'!AD30","v":439},{"$f":"'1a'!AE30","v":547},{"$f":"'1a'!AF30","v":505},{"$f":"'1a'!AG30","v":460},{"$f":"'1a'!AH30","v":458},{"$f":"'1a'!AI30","v":522},{"$f":"'1a'!AJ30","v":435},{"$f":"'1a'!AN29","v":815}]
["Sheriff Court - Summary",{"$f":"'1a'!D42","v":3016},{"$f":"'1a'!E42","v":3247},{"$f":"'1a'!F42","v":4309},{"$f":"'1a'!G42","v":6205},{"$f":"'1a'!H42","v":6037},{"$f":"'1a'!I42","v":5855},{"$f":"'1a'!J42","v":4634},{"$f":"'1a'!K42","v":4383},{"$f":"'1a'!L42","v":3956},{"$f":"'1a'!M42","v":3790},{"$f":"'1a'!N42","v":3678},{"$f":"'1a'!O42","v":5000},{"$f":"'1a'!P42","v":5017},{"$f":"'1a'!Q42","v":4603},{"$f":"'1a'!R42","v":4544},{"$f":"'1a'!S42","v":4440},{"$f":"'1a'!T42","v":4718},{"$f":"'1a'!U42","v":4453},{"$f":"'1a'!V42","v":4510},{"$f":"'1a'!W42","v":4770},{"$f":"'1a'!X42","v":4860},{"$f":"'1a'!Y42","v":4614},{"$f":"'1a'!Z42","v":4007},{"$f":"'1a'!AA42","v":4970},{"$f":"'1a'!AB42","v":4423},{"$f":"'1a'!AC42","v":4858},{"$f":"'1a'!AD42","v":5048},{"$f":"'1a'!AE42","v":4482},{"$f":"'1a'!AF42","v":4963},{"$f":"'1a'!AG42","v":4101},{"$f":"'1a'!AH42","v":4484},{"$f":"'1a'!AI42","v":5123},{"$f":"'1a'!AJ42","v":4350},{"$f":"'1a'!AN42","v":5457.5}]
["Justice of the Peace Court - Summary",{"$f":"'1a'!D54","v":1994},{"$f":"'1a'!E54","v":910},{"$f":"'1a'!F54","v":987},{"$f":"'1a'!G54","v":1823},{"$f":"'1a'!H54","v":1064},{"$f":"'1a'!I54","v":916},{"$f":"'1a'!J54","v":1717},{"$f":"'1a'!K54","v":1221},{"$f":"'1a'!L54","v":1426},{"$f":"'1a'!M54","v":1469},{"$f":"'1a'!N54","v":1345},{"$f":"'1a'!O54","v":2060},{"$f":"'1a'!P54","v":1992},{"$f":"'1a'!Q54","v":1731},{"$f":"'1a'!R54","v":2064},{"$f":"'1a'!S54","v":1717},{"$f":"'1a'!T54","v":2012},{"$f":"'1a'!U54","v":2133},{"$f":"'1a'!V54","v":2108},{"$f":"'1a'!W54","v":2034},{"$f":"'1a'!X54","v":1856},{"$f":"'1a'!Y54","v":1787},{"$f":"'1a'!Z54","v":1611},{"$f":"'1a'!AA54","v":2512},{"$f":"'1a'!AB54","v":1893},{"$f":"'1a'!AC54","v":2223},{"$f":"'1a'!AD54","v":2479},{"$f":"'1a'!AE54","v":1768},{"$f":"'1a'!AF54","v":2114},{"$f":"'1a'!AG54","v":1576},{"$f":"'1a'!AH54","v":1450},{"$f":"'1a'!AI54","v":1972},{"$f":"'1a'!AJ54","v":1206},{"$f":"'1a'!AN54","v":2798.5}]
[]
[]
["Trials Called",{"$f":"'1a'!D4","v":"2020-04-01"},{"$f":"'1a'!E4","v":"2020-05-01"},{"$f":"'1a'!F4","v":"2020-06-01"},{"$f":"'1a'!G4","v":"2020-07-01"},{"$f":"'1a'!H4","v":"2020-08-01"},{"$f":"'1a'!I4","v":"2020-09-01"},{"$f":"'1a'!J4","v":"2020-10-01"},{"$f":"'1a'!K4","v":"2020-11-01"},{"$f":"'1a'!L4","v":"2020-12-01"},{"$f":"'1a'!M4","v":"2021-01-01"},{"$f":"L3","v":"2021-02-01"},"2021-03-01","2021-04-01","2021-05-01","2021-06-01","2021-07-01",{"$f":"R3","v":"2021-08-01"},"2021-09-01",{"$f":"T3","v":"2021-10-01"},"2021-11-01",{"$f":"V3","v":"2021-12-01"},"2022-01-01",{"$f":"X3","v":"2022-02-01"},"2022-03-01",{"$f":"Z3","v":"2022-04-01"},"2022-05-01",{"$f":"AB3","v":"2022-06-01"},"2022-07-01",{"$f":"AD3","v":"2022-08-01"},"2022-09-01",{"$f":"AF3","v":"2022-10-01"},"2022-11-01",{"$f":"AH3","v":"2022-12-01"},"2019/20 monthly average","2020/21 YTD"]
["National",{"$f":"'1a'!D10","v":1019},{"$f":"'1a'!E10","v":476},{"$f":"'1a'!F10","v":192},{"$f":"'1a'!G10","v":355},{"$f":"'1a'!H10","v":2811},{"$f":"'1a'!I10","v":3950},{"$f":"'1a'!J10","v":3980},{"$f":"'1a'!K10","v":4386},{"$f":"'1a'!L10","v":3868},{"$f":"'1a'!M10","v":4882},{"$f":"'1a'!N10","v":1200},{"$f":"'1a'!O10","v":3101},{"$f":"'1a'!P10","v":3167},{"$f":"'1a'!Q10","v":3649},{"$f":"'1a'!R10","v":4577},{"$f":"'1a'!S10","v":5062},{"$f":"'1a'!T10","v":5917},{"$f":"'1a'!U10","v":6778},{"$f":"'1a'!V10","v":5449},{"$f":"'1a'!W10","v":4420},{"$f":"'1a'!X10","v":5882},{"$f":"'1a'!Y10","v":5648},{"$f":"'1a'!Z10","v":6472},{"$f":"'1a'!AA10","v":8276},{"$f":"'1a'!AB10","v":6556},{"$f":"'1a'!AC10","v":7431},{"$f":"'1a'!AD10","v":6820},{"$f":"'1a'!AE10","v":6134},{"$f":"'1a'!AF10","v":7457},{"$f":"'1a'!AG10","v":6901},{"$f":"'1a'!AH10","v":6897},{"$f":"'1a'!AI10","v":7273},{"$f":"'1a'!AJ10","v":5307},{"$f":"'1a'!AN10","v":4562}]
["High Court",{"$f":"'1a'!D21","v":0},{"$f":"'1a'!E21","v":0},{"$f":"'1a'!F21","v":0},{"$f":"'1a'!G21","v":4},{"$f":"'1a'!H21","v":14},{"$f":"'1a'!I21","v":26},{"$f":"'1a'!J21","v":42},{"$f":"'1a'!K21","v":58},{"$f":"'1a'!L21","v":47},{"$f":"'1a'!M21","v":56},{"$f":"'1a'!N21","v":67},{"$f":"'1a'!O21","v":66},{"$f":"'1a'!P21","v":46},{"$f":"'1a'!Q21","v":60},{"$f":"'1a'!R21","v":67},{"$f":"'1a'!S21","v":58},{"$f":"'1a'!T21","v":74},{"$f":"'1a'!U21","v":64},{"$f":"'1a'!V21","v":65},{"$f":"'1a'!W21","v":81},{"$f":"'1a'!X21","v":38},{"$f":"'1a'!Y21","v":62},{"$f":"'1a'!Z21","v":64},{"$f":"'1a'!AA21","v":73},{"$f":"'1a'!AB21","v":73},{"$f":"'1a'!AC21","v":87},{"$f":"'1a'!AD21","v":83},{"$f":"'1a'!AE21","v":64},{"$f":"'1a'!AF21","v":82},{"$f":"'1a'!AG21","v":86},{"$f":"'1a'!AH21","v":92},{"$f":"'1a'!AI21","v":79},{"$f":"'1a'!AJ21","v":42},{"$f":"'1a'!AN21","v":67.666666666666671}]
["Sheriff Court - Solemn",{"$f":"'1a'!D34","v":91},{"$f":"'1a'!E34","v":33},{"$f":"'1a'!F34","v":31},{"$f":"'1a'!G34","v":37},{"$f":"'1a'!H34","v":146},{"$f":"'1a'!I34","v":119},{"$f":"'1a'!J34","v":73},{"$f":"'1a'!K34","v":147},{"$f":"'1a'!L34","v":78},{"$f":"'1a'!M34","v":161},{"$f":"'1a'!N34","v":285},{"$f":"'1a'!O34","v":388},{"$f":"'1a'!P34","v":362},{"$f":"'1a'!Q34","v":368},{"$f":"'1a'!R34","v":383},{"$f":"'1a'!S34","v":340},{"$f":"'1a'!T34","v":392},{"$f":"'1a'!U34","v":396},{"$f":"'1a'!V34","v":393},{"$f":"'1a'!W34","v":273},{"$f":"'1a'!X34","v":263},{"$f":"'1a'!Y34","v":368},{"$f":"'1a'!Z34","v":433},{"$f":"'1a'!AA34","v":488},{"$f":"'1a'!AB34","v":425},{"$f":"'1a'!AC34","v":487},{"$f":"'1a'!AD34","v":458},{"$f":"'1a'!AE34","v":426},{"$f":"'1a'!AF34","v":537},{"$f":"'1a'!AG34","v":498},{"$f":"'1a'!AH34","v":548},{"$f":"'1a'!AI34","v":571},{"$f":"'1a'!AJ34","v":382},{"$f":"'1a'!AN34","v":261.83333333333331}]
["Sheriff Court - Summary",{"$f":"'1a'!D46","v":802},{"$f":"'1a'!E46","v":372},{"$f":"'1a'!F46","v":154},{"$f":"'1a'!G46","v":291},{"$f":"'1a'!H46","v":2343},{"$f":"'1a'!I46","v":3107},{"$f":"'1a'!J46","v":3207},{"$f":"'1a'!K46","v":3443},{"$f":"'1a'!L46","v":3090},{"$f":"'1a'!M46","v":3805},{"$f":"'1a'!N46","v":737},{"$f":"'1a'!O46","v":2371},{"$f":"'1a'!P46","v":2657},{"$f":"'1a'!Q46","v":3171},{"$f":"'1a'!R46","v":3887},{"$f":"'1a'!S46","v":4169},{"$f":"'1a'!T46","v":4499},{"$f":"'1a'!U46","v":5443},{"$f":"'1a'!V46","v":4266},{"$f":"'1a'!W46","v":3428},{"$f":"'1a'!X46","v":4703},{"$f":"'1a'!Y46","v":4537},{"$f":"'1a'!Z46","v":5093},{"$f":"'1a'!AA46","v":6599},{"$f":"'1a'!AB46","v":5094},{"$f":"'1a'!AC46","v":5768},{"$f":"'1a'!AD46","v":5308},{"$f":"'1a'!AE46","v":4758},{"$f":"'1a'!AF46","v":5724},{"$f":"'1a'!AG46","v":5256},{"$f":"'1a'!AH46","v":5179},{"$f":"'1a'!AI46","v":5461},{"$f":"'1a'!AJ46","v":4110},{"$f":"'1a'!AN46","v":3394.0833333333335}]
["Justice of the Peace Court - Summary",{"$f":"'1a'!D58","v":126},{"$f":"'1a'!E58","v":71},{"$f":"'1a'!F58","v":7},{"$f":"'1a'!G58","v":23},{"$f":"'1a'!H58","v":308},{"$f":"'1a'!I58","v":698},{"$f":"'1a'!J58","v":658},{"$f":"'1a'!K58","v":738},{"$f":"'1a'!L58","v":653},{"$f":"'1a'!M58","v":860},{"$f":"'1a'!N58","v":111},{"$f":"'1a'!O58","v":276},{"$f":"'1a'!P58","v":102},{"$f":"'1a'!Q58","v":50},{"$f":"'1a'!R58","v":240},{"$f":"'1a'!S58","v":495},{"$f":"'1a'!T58","v":952},{"$f":"'1a'!U58","v":875},{"$f":"'1a'!V58","v":725},{"$f":"'1a'!W58","v":638},{"$f":"'1a'!X58","v":878},{"$f":"'1a'!Y58","v":681},{"$f":"'1a'!Z58","v":882},{"$f":"'1a'!AA58","v":1116},{"$f":"'1a'!AB58","v":964},{"$f":"'1a'!AC58","v":1089},{"$f":"'1a'!AD58","v":971},{"$f":"'1a'!AE58","v":886},{"$f":"'1a'!AF58","v":1114},{"$f":"'1a'!AG58","v":1061},{"$f":"'1a'!AH58","v":1078},{"$f":"'1a'!AI58","v":1162},{"$f":"'1a'!AJ58","v":773},{"$f":"'1a'!AN58","v":838.41666666666663}]
[]
[]
["Trials called where evidence was led","2020-04-01","2020-05-01","2020-06-01","2020-07-01","2020-08-01","2020-09-01","2020-10-01","2020-11-01","2020-12-01","2021-01-01",{"$f":"L3","v":"2021-02-01"},"2021-03-01","2021-04-01","2021-05-01","2021-06-01","2021-07-01",{"$f":"R3","v":"2021-08-01"},"2021-09-01",{"$f":"T3","v":"2021-10-01"},"2021-11-01",{"$f":"V3","v":"2021-12-01"},"2022-01-01",{"$f":"X3","v":"2022-02-01"},"2022-03-01",{"$f":"Z3","v":"2022-04-01"},"2022-05-01",{"$f":"AB3","v":"2022-06-01"},"2022-07-01",{"$f":"AD3","v":"2022-08-01"},"2022-09-01",{"$f":"AF3","v":"2022-10-01"},"2022-11-01",{"$f":"AH3","v":"2022-12-01"},"2019/20 monthly average","2020/21 YTD"]
["National",{"$f":"'1a'!D11","v":5},{"$f":"'1a'!E11","v":9},{"$f":"'1a'!F11","v":24},{"$f":"'1a'!G11","v":84},{"$f":"'1a'!H11","v":320},{"$f":"'1a'!I11","v":526},{"$f":"'1a'!J11","v":575},{"$f":"'1a'!K11","v":627},{"$f":"'1a'!L11","v":512},{"$f":"'1a'!M11","v":276},{"$f":"'1a'!N11","v":186},{"$f":"'1a'!O11","v":401},{"$f":"'1a'!P11","v":470},{"$f":"'1a'!Q11","v":558},{"$f":"'1a'!R11","v":622},{"$f":"'1a'!S11","v":583},{"$f":"'1a'!T11","v":664},{"$f":"'1a'!U11","v":775},{"$f":"'1a'!V11","v":626},{"$f":"'1a'!W11","v":541},{"$f":"'1a'!X11","v":549},{"$f":"'1a'!Y11","v":536},{"$f":"'1a'!Z11","v":754},{"$f":"'1a'!AA11","v":827},{"$f":"'1a'!AB11","v":691},{"$f":"'1a'!AC11","v":830},{"$f":"'1a'!AD11","v":696},{"$f":"'1a'!AE11","v":620},{"$f":"'1a'!AF11","v":791},{"$f":"'1a'!AG11","v":716},{"$f":"'1a'!AH11","v":775},{"$f":"'1a'!AI11","v":842},{"$f":"'1a'!AJ11","v":602},{"$f":"'1a'!AN11","v":843.41666666666663}]
["High Court",{"$f":"'1a'!D22","v":0},{"$f":"'1a'!E22","v":0},{"$f":"'1a'!F22","v":0},{"$f":"'1a'!G22","v":4},{"$f":"'1a'!H22","v":14},{"$f":"'1a'!I22","v":18},{"$f":"'1a'!J22","v":28},{"$f":"'1a'!K22","v":49},{"$f":"'1a'!L22","v":29},{"$f":"'1a'!M22","v":43},{"$f":"'1a'!N22","v":42},{"$f":"'1a'!O22","v":51},{"$f":"'1a'!P22","v":34},{"$f":"'1a'!Q22","v":43},{"$f":"'1a'!R22","v":47},{"$f":"'1a'!S22","v":48},{"$f":"'1a'!T22","v":55},{"$f":"'1a'!U22","v":47},{"$f":"'1a'!V22","v":54},{"$f":"'1a'!W22","v":63},{"$f":"'1a'!X22","v":30},{"$f":"'1a'!Y22","v":47},{"$f":"'1a'!Z22","v":54},{"$f":"'1a'!AA22","v":55},{"$f":"'1a'!AB22","v":50},{"$f":"'1a'!AC22","v":56},{"$f":"'1a'!AD22","v":53},{"$f":"'1a'!AE22","v":42},{"$f":"'1a'!AF22","v":56},{"$f":"'1a'!AG22","v":48},{"$f":"'1a'!AH22","v":51},{"$f":"'1a'!AI22","v":55},{"$f":"'1a'!AJ22","v":30},{"$f":"'1a'!AN22","v":41.5}]
["Sheriff Court - Solemn",{"$f":"'1a'!D35","v":0},{"$f":"'1a'!E35","v":0},{"$f":"'1a'!F35","v":0},{"$f":"'1a'!G35","v":0},{"$f":"'1a'!H35","v":0},{"$f":"'1a'!I35","v":0},{"$f":"'1a'!J35","v":0},{"$f":"'1a'!K35","v":0},{"$f":"'1a'!L35","v":11},{"$f":"'1a'!M35","v":30},{"$f":"'1a'!N35","v":56},{"$f":"'1a'!O35","v":100},{"$f":"'1a'!P35","v":84},{"$f":"'1a'!Q35","v":82},{"$f":"'1a'!R35","v":88},{"$f":"'1a'!S35","v":76},{"$f":"'1a'!T35","v":83},{"$f":"'1a'!U35","v":95},{"$f":"'1a'!V35","v":70},{"$f":"'1a'!W35","v":48},{"$f":"'1a'!X35","v":52},{"$f":"'1a'!Y35","v":56},{"$f":"'1a'!Z35","v":78},{"$f":"'1a'!AA35","v":95},{"$f":"'1a'!AB35","v":75},{"$f":"'1a'!AC35","v":94},{"$f":"'1a'!AD35","v":73},{"$f":"'1a'!AE35","v":70},{"$f":"'1a'!AF35","v":93},{"$f":"'1a'!AG35","v":100},{"$f":"'1a'!AH35","v":72},{"$f":"'1a'!AI35","v":117},{"$f":"'1a'!AJ35","v":65},{"$f":"'1a'!AN35","v":94.5}]
["Sheriff Court - Summary",{"$f":"'1a'!D47","v":5},{"$f":"'1a'!E47","v":9},{"$f":"'1a'!F47","v":24},{"$f":"'1a'!G47","v":79},{"$f":"'1a'!H47","v":283},{"$f":"'1a'!I47","v":440},{"$f":"'1a'!J47","v":479},{"$f":"'1a'!K47","v":491},{"$f":"'1a'!L47","v":399},{"$f":"'1a'!M47","v":176},{"$f":"'1a'!N47","v":86},{"$f":"'1a'!O47","v":250},{"$f":"'1a'!P47","v":352},{"$f":"'1a'!Q47","v":433},{"$f":"'1a'!R47","v":471},{"$f":"'1a'!S47","v":408},{"$f":"'1a'!T47","v":459},{"$f":"'1a'!U47","v":551},{"$f":"'1a'!V47","v":439},{"$f":"'1a'!W47","v":385},{"$f":"'1a'!X47","v":422},{"$f":"'1a'!Y47","v":427},{"$f":"'1a'!Z47","v":552},{"$f":"'1a'!AA47","v":604},{"$f":"'1a'!AB47","v":505},{"$f":"'1a'!AC47","v":589},{"$f":"'1a'!AD47","v":495},{"$f":"'1a'!AE47","v":431},{"$f":"'1a'!AF47","v":571},{"$f":"'1a'!AG47","v":474},{"$f":"'1a'!AH47","v":561},{"$f":"'1a'!AI47","v":560},{"$f":"'1a'!AJ47","v":437},{"$f":"'1a'!AN47","v":578.83333333333337}]
["Justice of the Peace Court - Summary",{"$f":"'1a'!D59","v":0},{"$f":"'1a'!E59","v":0},{"$f":"'1a'!F59","v":0},{"$f":"'1a'!G59","v":1},{"$f":"'1a'!H59","v":23},{"$f":"'1a'!I59","v":68},{"$f":"'1a'!J59","v":68},{"$f":"'1a'!K59","v":87},{"$f":"'1a'!L59","v":73},{"$f":"'1a'!M59","v":27},{"$f":"'1a'!N59","v":2},{"$f":"'1a'!O59","v":0},{"$f":"'1a'!P59","v":0},{"$f":"'1a'!Q59","v":0},{"$f":"'1a'!R59","v":16},{"$f":"'1a'!S59","v":51},{"$f":"'1a'!T59","v":67},{"$f":"'1a'!U59","v":82},{"$f":"'1a'!V59","v":63},{"$f":"'1a'!W59","v":45},{"$f":"'1a'!X59","v":45},{"$f":"'1a'!Y59","v":6},{"$f":"'1a'!Z59","v":70},{"$f":"'1a'!AA59","v":73},{"$f":"'1a'!AB59","v":61},{"$f":"'1a'!AC59","v":91},{"$f":"'1a'!AD59","v":75},{"$f":"'1a'!AE59","v":77},{"$f":"'1a'!AF59","v":71},{"$f":"'1a'!AG59","v":94},{"$f":"'1a'!AH59","v":91},{"$f":"'1a'!AI59","v":110},{"$f":"'1a'!AJ59","v":70},{"$f":"'1a'!AN59","v":128.58333333333334}]
[]
[]
["Cases concluded","2020-04-01","2020-05-01","2020-06-01","2020-07-01","2020-08-01","2020-09-01","2020-10-01","2020-11-01","2020-12-01","2021-01-01",{"$f":"L3","v":"2021-02-01"},"2021-03-01","2021-04-01","2021-05-01","2021-06-01","2021-07-01",{"$f":"R3","v":"2021-08-01"},"2021-09-01",{"$f":"T3","v":"2021-10-01"},"2021-11-01",{"$f":"V3","v":"2021-12-01"},"2022-01-01",{"$f":"X3","v":"2022-02-01"},"2022-03-01",{"$f":"Z3","v":"2022-04-01"},"2022-05-01",{"$f":"AB3","v":"2022-06-01"},"2022-07-01",{"$f":"AD3","v":"2022-08-01"},"2022-09-01",{"$f":"AF3","v":"2022-10-01"},"2022-11-01",{"$f":"AH3","v":"2022-12-01"},"2019/20 monthly average","2020/21 YTD"]
["National",{"$f":"'1a'!D14","v":586},{"$f":"'1a'!E14","v":930},{"$f":"'1a'!F14","v":1519},{"$f":"'1a'!G14","v":2892},{"$f":"'1a'!H14","v":5792},{"$f":"'1a'!I14","v":6959},{"$f":"'1a'!J14","v":6407},{"$f":"'1a'!K14","v":6257},{"$f":"'1a'!L14","v":5922},{"$f":"'1a'!M14","v":3070},{"$f":"'1a'!N14","v":2226},{"$f":"'1a'!O14","v":3599},{"$f":"'1a'!P14","v":4188},{"$f":"'1a'!Q14","v":4996},{"$f":"'1a'!R14","v":7085},{"$f":"'1a'!S14","v":7989},{"$f":"'1a'!T14","v":7978},{"$f":"'1a'!U14","v":8185},{"$f":"'1a'!V14","v":6594},{"$f":"'1a'!W14","v":6579},{"$f":"'1a'!X14","v":6610},{"$f":"'1a'!Y14","v":6041},{"$f":"'1a'!Z14","v":7220},{"$f":"'1a'!AA14","v":8682},{"$f":"'1a'!AB14","v":7621},{"$f":"'1a'!AC14","v":8752},{"$f":"'1a'!AD14","v":8138},{"$f":"'1a'!AE14","v":7616},{"$f":"'1a'!AF14","v":8450},{"$f":"'1a'!AG14","v":7570},{"$f":"'1a'!AH14","v":7531},{"$f":"'1a'!AI14","v":8049},{"$f":"'1a'!AJ14","v":6282},{"$f":"'1a'!AN14","v":7825.25}]
["High Court",{"$f":"'1a'!D25","v":7},{"$f":"'1a'!E25","v":9},{"$f":"'1a'!F25","v":14},{"$f":"'1a'!G25","v":32},{"$f":"'1a'!H25","v":35},{"$f":"'1a'!I25","v":20},{"$f":"'1a'!J25","v":39},{"$f":"'1a'!K25","v":54},{"$f":"'1a'!L25","v":54},{"$f":"'1a'!M25","v":55},{"$f":"'1a'!N25","v":72},{"$f":"'1a'!O25","v":64},{"$f":"'1a'!P25","v":53},{"$f":"'1a'!Q25","v":58},{"$f":"'1a'!R25","v":62},{"$f":"'1a'!S25","v":58},{"$f":"'1a'!T25","v":76},{"$f":"'1a'!U25","v":62},{"$f":"'1a'!V25","v":70},{"$f":"'1a'!W25","v":82},{"$f":"'1a'!X25","v":56},{"$f":"'1a'!Y25","v":45},{"$f":"'1a'!Z25","v":57},{"$f":"'1a'!AA25","v":77},{"$f":"'1a'!AB25","v":66},{"$f":"'1a'!AC25","v":73},{"$f":"'1a'!AD25","v":74},{"$f":"'1a'!AE25","v":66},{"$f":"'1a'!AF25","v":62},{"$f":"'1a'!AG25","v":69},{"$f":"'1a'!AH25","v":70},{"$f":"'1a'!AI25","v":71},{"$f":"'1a'!AJ25","v":54},{"$f":"'1a'!AN25","v":67.166666666666671}]
["Sheriff Court - Solemn",{"$f":"'1a'!D38","v":140},{"$f":"'1a'!E38","v":127},{"$f":"'1a'!F38","v":166},{"$f":"'1a'!G38","v":174},{"$f":"'1a'!H38","v":284},{"$f":"'1a'!I38","v":358},{"$f":"'1a'!J38","v":322},{"$f":"'1a'!K38","v":276},{"$f":"'1a'!L38","v":300},{"$f":"'1a'!M38","v":317},{"$f":"'1a'!N38","v":354},{"$f":"'1a'!O38","v":468},{"$f":"'1a'!P38","v":463},{"$f":"'1a'!Q38","v":442},{"$f":"'1a'!R38","v":459},{"$f":"'1a'!S38","v":453},{"$f":"'1a'!T38","v":451},{"$f":"'1a'!U38","v":439},{"$f":"'1a'!V38","v":403},{"$f":"'1a'!W38","v":414},{"$f":"'1a'!X38","v":363},{"$f":"'1a'!Y38","v":357},{"$f":"'1a'!Z38","v":427},{"$f":"'1a'!AA38","v":461},{"$f":"'1a'!AB38","v":475},{"$f":"'1a'!AC38","v":458},{"$f":"'1a'!AD38","v":488},{"$f":"'1a'!AE38","v":418},{"$f":"'1a'!AF38","v":524},{"$f":"'1a'!AG38","v":479},{"$f":"'1a'!AH38","v":494},{"$f":"'1a'!AI38","v":484},{"$f":"'1a'!AJ38","v":419},{"$f":"'1a'!AN38","v":429.58333333333331}]
["Sheriff Court - Summary",{"$f":"'1a'!D50","v":429},{"$f":"'1a'!E50","v":744},{"$f":"'1a'!F50","v":1146},{"$f":"'1a'!G50","v":2227},{"$f":"'1a'!H50","v":4084},{"$f":"'1a'!I50","v":4759},{"$f":"'1a'!J50","v":4395},{"$f":"'1a'!K50","v":4244},{"$f":"'1a'!L50","v":3944},{"$f":"'1a'!M50","v":2071},{"$f":"'1a'!N50","v":1665},{"$f":"'1a'!O50","v":2735},{"$f":"'1a'!P50","v":3466},{"$f":"'1a'!Q50","v":4181},{"$f":"'1a'!R50","v":4547},{"$f":"'1a'!S50","v":4446},{"$f":"'1a'!T50","v":4654},{"$f":"'1a'!U50","v":5186},{"$f":"'1a'!V50","v":4099},{"$f":"'1a'!W50","v":4162},{"$f":"'1a'!X50","v":4410},{"$f":"'1a'!Y50","v":4126},{"$f":"'1a'!Z50","v":4995},{"$f":"'1a'!AA50","v":5929},{"$f":"'1a'!AB50","v":4987},{"$f":"'1a'!AC50","v":5865},{"$f":"'1a'!AD50","v":5272},{"$f":"'1a'!AE50","v":4989},{"$f":"'1a'!AF50","v":5695},{"$f":"'1a'!AG50","v":5088},{"$f":"'1a'!AH50","v":5054},{"$f":"'1a'!AI50","v":5420},{"$f":"'1a'!AJ50","v":4278},{"$f":"'1a'!AN50","v":4771.333333333333}]
["Justice of the Peace Court - Summary",{"$f":"'1a'!D62","v":10},{"$f":"'1a'!E62","v":50},{"$f":"'1a'!F62","v":193},{"$f":"'1a'!G62","v":459},{"$f":"'1a'!H62","v":1389},{"$f":"'1a'!I62","v":1822},{"$f":"'1a'!J62","v":1651},{"$f":"'1a'!K62","v":1683},{"$f":"'1a'!L62","v":1624},{"$f":"'1a'!M62","v":627},{"$f":"'1a'!N62","v":135},{"$f":"'1a'!O62","v":332},{"$f":"'1a'!P62","v":206},{"$f":"'1a'!Q62","v":315},{"$f":"'1a'!R62","v":2017},{"$f":"'1a'!S62","v":3032},{"$f":"'1a'!T62","v":2797},{"$f":"'1a'!U62","v":2498},{"$f":"'1a'!V62","v":2022},{"$f":"'1a'!W62","v":1921},{"$f":"'1a'!X62","v":1781},{"$f":"'1a'!Y62","v":1513},{"$f":"'1a'!Z62","v":1741},{"$f":"'1a'!AA62","v":2215},{"$f":"'1a'!AB62","v":2093},{"$f":"'1a'!AC62","v":2356},{"$f":"'1a'!AD62","v":2304},{"$f":"'1a'!AE62","v":2143},{"$f":"'1a'!AF62","v":2169},{"$f":"'1a'!AG62","v":1934},{"$f":"'1a'!AH62","v":1913},{"$f":"'1a'!AI62","v":2074},{"$f":"'1a'!AJ62","v":1531},{"$f":"'1a'!AN62","v":2557.1666666666665}]
[]
[]
["Trial delay - average time between pleading diet and evidence led trial, where evidence led trial occurred in the period shown (weeks)","2020-04-01","2020-05-01","2020-06-01","2020-07-01","2020-08-01","2020-09-01","2020-10-01","2020-11-01","2020-12-01","2021-01-01","2021-02-01","2021-03-01","2021-04-01","2021-05-01","2021-06-01","2021-07-01","2021-08-01","2021-09-01","2021-10-01","2021-11-01","2021-12-01","2022-01-01","2022-02-01","2022-03-01","2022-04-01","2022-05-01","2022-06-01","2022-07-01","2022-08-01","2022-09-01","2022-10-01","2022-11-01","2022-12-01","2020/21 YTD"]
["High Court",{"$f":"'1a'!D26","v":20},{"$f":"'1a'!E26","v":"N/A"},{"$f":"'1a'!F26","v":"N/A"},{"$f":"'1a'!G26","v":21},{"$f":"'1a'!H26","v":34},{"$f":"'1a'!I26","v":35},{"$f":"'1a'!J26","v":50},{"$f":"'1a'!K26","v":52},{"$f":"'1a'!L26","v":54},{"$f":"'1a'!M26","v":52},{"$f":"'1a'!N26","v":54},{"$f":"'1a'!O26","v":66},{"$f":"'1a'!P26","v":58},{"$f":"'1a'!Q26","v":51},{"$f":"'1a'!R26","v":50},{"$f":"'1a'!S26","v":55},{"$f":"'1a'!T26","v":51},{"$f":"'1a'!U26","v":54},{"$f":"'1a'!V26","v":50},{"$f":"'1a'!W26","v":51},{"$f":"'1a'!X26","v":57},{"$f":"'1a'!Y26","v":62},{"$f":"'1a'!Z26","v":48},{"$f":"'1a'!AA26","v":48},{"$f":"'1a'!AB26","v":49},{"$f":"'1a'!AC26","v":53},{"$f":"'1a'!AD26","v":46},{"$f":"'1a'!AE26","v":46},{"$f":"'1a'!AF26","v":49},{"$f":"'1a'!AG26","v":46},{"$f":"'1a'!AH26","v":52},{"$f":"'1a'!AI26","v":43},{"$f":"'1a'!AJ26","v":49}]
["Sheriff Court - Solemn",{"$f":"'1a'!D39","v":"N/A"},{"$f":"'1a'!E39","v":"N/A"},{"$f":"'1a'!F39","v":"N/A"},{"$f":"'1a'!G39","v":"N/A"},{"$f":"'1a'!H39","v":"N/A"},{"$f":"'1a'!I39","v":"N/A"},{"$f":"'1a'!J39","v":"N/A"},{"$f":"'1a'!K39","v":"N/A"},{"$f":"'1a'!L39","v":29.975454545454546},{"$f":"'1a'!M39","v":32.182999999999993},{"$f":"'1a'!N39","v":35.683749999999996},{"$f":"'1a'!O39","v":37},{"$f":"'1a'!P39","v":38.311309523809513},{"$f":"'1a'!Q39","v":43.999390243902425},{"$f":"'1a'!R39","v":41.658181818181816},{"$f":"'1a'!S39","v":41.361184210526318},{"$f":"'1a'!T39","v":44.76650602409638},{"$f":"'1a'!U39","v":42.948947368421059},{"$f":"'1a'!V39","v":41.784857142857149},{"$f":"'1a'!W39","v":48.342916666666667},{"$f":"'1a'!X39","v":40.551346153846154},{"$f":"'1a'!Y39","v":40.661607142857143},{"$f":"'1a'!Z39","v":44.063205128205126},{"$f":"'1a'!AA39","v":45.251368421052632},{"$f":"'1a'!AB39","v":40.514266666666671},{"$f":"'1a'!AC39","v":50.807127659574469},{"$f":"'1a'!AD39","v":51.62821917808219},{"$f":"'1a'!AE39","v":44.089571428571432},{"$f":"'1a'!AF39","v":44.465053763440871},{"$f":"'1a'!AG39","v":42.515000000000008},{"$f":"'1a'!AH39","v":40.917083333333331},{"$f":"'1a'!AI39","v":46.4657264957265},{"$f":"'1a'!AJ39","v":46.27061538461539}]
["Sheriff Court - Summary",{"$f":"'1a'!D51","v":7.0840000000000005},{"$f":"'1a'!E51","v":3.8433333333333337},{"$f":"'1a'!F51","v":11.475000000000001},{"$f":"'1a'!G51","v":21.380506329113924},{"$f":"'1a'!H51","v":34.065795053003527},{"$f":"'1a'!I51","v":37.83834090909091},{"$f":"'1a'!J51","v":35.172505219206677},{"$f":"'1a'!K51","v":33.833217922606913},{"$f":"'1a'!L51","v":34.112481203007512},{"$f":"'1a'!M51","v":36.059147727272737},{"$f":"'1a'!N51","v":35.496279069767454},{"$f":"'1a'!O51","v":34.892799999999994},{"$f":"'1a'!P51","v":34.803607954545448},{"$f":"'1a'!Q51","v":36.660762124711319},{"$f":"'1a'!R51","v":41.735180467091311},{"$f":"'1a'!S51","v":44.970416666666679},{"$f":"'1a'!T51","v":45.601045751633997},{"$f":"'1a'!U51","v":48.230235934664236},{"$f":"'1a'!V51","v":47.259476082004547},{"$f":"'1a'!W51","v":45.570337662337657},{"$f":"'1a'!X51","v":46.96611374407582},{"$f":"'1a'!Y51","v":49.673278688524583},{"$f":"'1a'!Z51","v":52.493641304347818},{"$f":"'1a'!AA51","v":50.45658940397351},{"$f":"'1a'!AB51","v":52.718000000000004},{"$f":"'1a'!AC51","v":50.103276740237689},{"$f":"'1a'!AD51","v":49.937777777777775},{"$f":"'1a'!AE51","v":44.448329466357315},{"$f":"'1a'!AF51","v":49.132294220665507},{"$f":"'1a'!AG51","v":49.651877637130802},{"$f":"'1a'!AH51","v":46.876844919786095},{"$f":"'1a'!AI51","v":44.626607142857132},{"$f":"'1a'!AJ51","v":46.496842105263148}]
["Justice of the Peace Court - Summary",{"$f":"'1a'!D63","v":"N/A"},{"$f":"'1a'!E63","v":"N/A"},{"$f":"'1a'!F63","v":"N/A"},{"$f":"'1a'!G63","v":36.29},{"$f":"'1a'!H63","v":34.076956521739127},{"$f":"'1a'!I63","v":37.386911764705879},{"$f":"'1a'!J63","v":36.722352941176467},{"$f":"'1a'!K63","v":41.482298850574708},{"$f":"'1a'!L63","v":37.755342465753415},{"$f":"'1a'!M63","v":37.104444444444439},{"$f":"'1a'!N63","v":54.93},{"$f":"'1a'!O63","v":"N/A"},{"$f":"'1a'!P63","v":"N/A"},{"$f":"'1a'!Q63","v":"N/A"},{"$f":"'1a'!R63","v":58.126249999999999},{"$f":"'1a'!S63","v":58.448627450980396},{"$f":"'1a'!T63","v":58.657164179104484},{"$f":"'1a'!U63","v":55.040365853658528},{"$f":"'1a'!V63","v":59.379206349206356},{"$f":"'1a'!W63","v":59.828888888888883},{"$f":"'1a'!X63","v":58.783555555555559},{"$f":"'1a'!Y63","v":59.025000000000006},{"$f":"'1a'!Z63","v":56.403428571428563},{"$f":"'1a'!AA63","v":54.183013698630134},{"$f":"'1a'!AB63","v":53.937540983606553},{"$f":"'1a'!AC63","v":56.986263736263744},{"$f":"'1a'!AD63","v":54.575600000000016},{"$f":"'1a'!AE63","v":52.053636363636365},{"$f":"'1a'!AF63","v":47.660845070422546},{"$f":"'1a'!AG63","v":52.03319148936172},{"$f":"'1a'!AH63","v":55.113296703296704},{"$f":"'1a'!AI63","v":52.520545454545456},{"$f":"'1a'!AJ63","v":41.869142857142862}]
["High Court (as at end of 2019/20)",{"$f":"'1a'!$AN$26","v":22.1},{"$f":"'1a'!$AN$26","v":22.1},{"$f":"'1a'!$AN$26","v":22.1},{"$f":"'1a'!$AN$26","v":22.1},{"$f":"'1a'!$AN$26","v":22.1},{"$f":"'1a'!$AN$26","v":22.1},{"$f":"'1a'!$AN$26","v":22.1},{"$f":"'1a'!$AN$26","v":22.1},{"$f":"'1a'!$AN$26","v":22.1},{"$f":"'1a'!$AN$26","v":22.1},{"$f":"'1a'!$AN$26","v":22.1},{"$f":"'1a'!$AN$26","v":22.1},{"$f":"'1a'!$AN$26","v":22.1},{"$f":"'1a'!$AN$26","v":22.1},{"$f":"'1a'!$AN$26","v":22.1},{"$f":"'1a'!$AN$26","v":22.1},{"$f":"'1a'!$AN$26","v":22.1},{"$f":"'1a'!$AN$26","v":22.1},{"$f":"'1a'!$AN$26","v":22.1},{"$f":"'1a'!$AN$26","v":22.1},{"$f":"'1a'!$AN$26","v":22.1},{"$f":"'1a'!$AN$26","v":22.1},{"$f":"'1a'!$AN$26","v":22.1},{"$f":"'1a'!$AN$26","v":22.1},{"$f":"'1a'!$AN$26","v":22.1},{"$f":"'1a'!$AN$26","v":22.1},{"$f":"'1a'!$AN$26","v":22.1},{"$f":"'1a'!$AN$26","v":22.1},{"$f":"'1a'!$AN$26","v":22.1},{"$f":"'1a'!$AN$26","v":22.1},{"$f":"'1a'!$AN$26","v":22.1},{"$f":"'1a'!$AN$26","v":22.1},{"$f":"'1a'!$AN$26","v":22.1}]
["Sheriff Court - Solemn (as at end of 2019/20)",{"$f":"'1a'!$AN$39","v":11},{"$f":"'1a'!$AN$39","v":11},{"$f":"'1a'!$AN$39","v":11},{"$f":"'1a'!$AN$39","v":11},{"$f":"'1a'!$AN$39","v":11},{"$f":"'1a'!$AN$39","v":11},{"$f":"'1a'!$AN$39","v":11},{"$f":"'1a'!$AN$39","v":11},{"$f":"'1a'!$AN$39","v":11},{"$f":"'1a'!$AN$39","v":11},{"$f":"'1a'!$AN$39","v":11},{"$f":"'1a'!$AN$39","v":11},{"$f":"'1a'!$AN$39","v":11},{"$f":"'1a'!$AN$39","v":11},{"$f":"'1a'!$AN$39","v":11},{"$f":"'1a'!$AN$39","v":11},{"$f":"'1a'!$AN$39","v":11},{"$f":"'1a'!$AN$39","v":11},{"$f":"'1a'!$AN$39","v":11},{"$f":"'1a'!$AN$39","v":11},{"$f":"'1a'!$AN$39","v":11},{"$f":"'1a'!$AN$39","v":11},{"$f":"'1a'!$AN$39","v":11},{"$f":"'1a'!$AN$39","v":11},{"$f":"'1a'!$AN$39","v":11},{"$f":"'1a'!$AN$39","v":11},{"$f":"'1a'!$AN$39","v":11},{"$f":"'1a'!$AN$39","v":11},{"$f":"'1a'!$AN$39","v":11},{"$f":"'1a'!$AN$39","v":11},{"$f":"'1a'!$AN$39","v":11},{"$f":"'1a'!$AN$39","v":11},{"$f":"'1a'!$AN$39","v":11}]
["Sheriff Court - Summary (as at end of 2019/20)",{"$f":"'1a'!$AN$51","v":23},{"$f":"'1a'!$AN$51","v":23},{"$f":"'1a'!$AN$51","v":23},{"$f":"'1a'!$AN$51","v":23},{"$f":"'1a'!$AN$51","v":23},{"$f":"'1a'!$AN$51","v":23},{"$f":"'1a'!$AN$51","v":23},{"$f":"'1a'!$AN$51","v":23},{"$f":"'1a'!$AN$51","v":23},{"$f":"'1a'!$AN$51","v":23},{"$f":"'1a'!$AN$51","v":23},{"$f":"'1a'!$AN$51","v":23},{"$f":"'1a'!$AN$51","v":23},{"$f":"'1a'!$AN$51","v":23},{"$f":"'1a'!$AN$51","v":23},{"$f":"'1a'!$AN$51","v":23},{"$f":"'1a'!$AN$51","v":23},{"$f":"'1a'!$AN$51","v":23},{"$f":"'1a'!$AN$51","v":23},{"$f":"'1a'!$AN$51","v":23},{"$f":"'1a'!$AN$51","v":23},{"$f":"'1a'!$AN$51","v":23},{"$f":"'1a'!$AN$51","v":23},{"$f":"'1a'!$AN$51","v":23},{"$f":"'1a'!$AN$51","v":23},{"$f":"'1a'!$AN$51","v":23},{"$f":"'1a'!$AN$51","v":23},{"$f":"'1a'!$AN$51","v":23},{"$f":"'1a'!$AN$51","v":23},{"$f":"'1a'!$AN$51","v":23},{"$f":"'1a'!$AN$51","v":23},{"$f":"'1a'!$AN$51","v":23},{"$f":"'1a'!$AN$51","v":23}]
["Justice of the Peace Court - Summary (as at end of 2019/20)",{"$f":"'1a'!$AN$63","v":22},{"$f":"'1a'!$AN$63","v":22},{"$f":"'1a'!$AN$63","v":22},{"$f":"'1a'!$AN$63","v":22},{"$f":"'1a'!$AN$63","v":22},{"$f":"'1a'!$AN$63","v":22},{"$f":"'1a'!$AN$63","v":22},{"$f":"'1a'!$AN$63","v":22},{"$f":"'1a'!$AN$63","v":22},{"$f":"'1a'!$AN$63","v":22},{"$f":"'1a'!$AN$63","v":22},{"$f":"'1a'!$AN$63","v":22},{"$f":"'1a'!$AN$63","v":22},{"$f":"'1a'!$AN$63","v":22},{"$f":"'1a'!$AN$63","v":22},{"$f":"'1a'!$AN$63","v":22},{"$f":"'1a'!$AN$63","v":22},{"$f":"'1a'!$AN$63","v":22},{"$f":"'1a'!$AN$63","v":22},{"$f":"'1a'!$AN$63","v":22},{"$f":"'1a'!$AN$63","v":22},{"$f":"'1a'!$AN$63","v":22},{"$f":"'1a'!$AN$63","v":22},{"$f":"'1a'!$AN$63","v":22},{"$f":"'1a'!$AN$63","v":22},{"$f":"'1a'!$AN$63","v":22},{"$f":"'1a'!$AN$63","v":22},{"$f":"'1a'!$AN$63","v":22},{"$f":"'1a'!$AN$63","v":22},{"$f":"'1a'!$AN$63","v":22},{"$f":"'1a'!$AN$63","v":22},{"$f":"'1a'!$AN$63","v":22},{"$f":"'1a'!$AN$63","v":22}]
[]
[]
[]
["Scheduled trials","2020-04-01","2020-05-01","2020-06-01","2020-07-01","2020-08-01","2020-09-01","2020-10-01","2020-11-01","2020-12-01",{"$f":"K27","v":"2021-01-01"},{"$f":"L27","v":"2021-02-01"},{"$f":"M27","v":"2021-03-01"},{"$f":"N3","v":"2021-04-01"},"2021-05-01","2021-06-01","2021-07-01","2021-08-01",{"$f":"S3","v":"2021-09-01"},"2021-10-01","2021-11-01","2021-12-01","2022-01-01",{"$f":"X3","v":"2022-02-01"},"2022-03-01","2022-04-01","2022-05-01","2022-06-01","2022-07-01",{"$f":"AD3","v":"2022-08-01"},"2022-09-01",{"$f":"AF3","v":"2022-10-01"},"2022-11-01",{"$f":"AH3","v":"2022-12-01"},"2020/21 YTD"]
["National",{"$f":"'1a'!D15","v":18074},{"$f":"'1a'!E15","v":20236},{"$f":"'1a'!F15","v":22437},{"$f":"'1a'!G15","v":25900},{"$f":"'1a'!H15","v":28351},{"$f":"'1a'!I15","v":30956},{"$f":"'1a'!J15","v":32427},{"$f":"'1a'!K15","v":33590},{"$f":"'1a'!L15","v":34283},{"$f":"'1a'!M15","v":35067},{"$f":"'1a'!N15","v":36037},{"$f":"'1a'!O15","v":37801},{"$f":"'1a'!P15","v":39488},{"$f":"'1a'!Q15","v":40882},{"$f":"'1a'!R15","v":42451},{"$f":"'1a'!S15","v":43341},{"$f":"'1a'!T15","v":43526},{"$f":"'1a'!U15","v":42550},{"$f":"'1a'!V15","v":42756},{"$f":"'1a'!W15","v":43597},{"$f":"'1a'!X15","v":43016},{"$f":"'1a'!Y15","v":43606},{"$f":"'1a'!Z15","v":42503},{"$f":"'1a'!AA15","v":40923},{"$f":"'1a'!AB15","v":39958},{"$f":"'1a'!AC15","v":38499},{"$f":"'1a'!AD15","v":37174},{"$f":"'1a'!AE15","v":36184},{"$f":"'1a'!AF15","v":34734},{"$f":"'1a'!AG15","v":33594},{"$f":"'1a'!AH15","v":31562},{"$f":"'1a'!AI15","v":30588},{"$f":"'1a'!AJ15","v":30305}]
["National (as at end of 2019/20)",{"$f":"'1a'!$AN$15","v":18355},{"$f":"'1a'!$AN$15","v":18355},{"$f":"'1a'!$AN$15","v":18355},{"$f":"'1a'!$AN$15","v":18355},{"$f":"'1a'!$AN$15","v":18355},{"$f":"'1a'!$AN$15","v":18355},{"$f":"'1a'!$AN$15","v":18355},{"$f":"'1a'!$AN$15","v":18355},{"$f":"'1a'!$AN$15","v":18355},{"$f":"'1a'!$AN$15","v":18355},{"$f":"'1a'!$AN$15","v":18355},{"$f":"'1a'!$AN$15","v":18355},{"$f":"'1a'!$AN$15","v":18355},{"$f":"'1a'!$AN$15","v":18355},{"$f":"'1a'!$AN$15","v":18355},{"$f":"'1a'!$AN$15","v":18355},{"$f":"'1a'!$AN$15","v":18355},{"$f":"'1a'!$AN$15","v":18355},{"$f":"'1a'!$AN$15","v":18355},{"$f":"'1a'!$AN$15","v":18355},{"$f":"'1a'!$AN$15","v":18355},{"$f":"'1a'!$AN$15","v":18355},{"$f":"'1a'!$AN$15","v":18355},{"$f":"'1a'!$AN$15","v":18355},{"$f":"'1a'!$AN$15","v":18355},{"$f":"'1a'!$AN$15","v":18355},{"$f":"'1a'!$AN$15","v":18355},{"$f":"'1a'!$AN$15","v":18355},{"$f":"'1a'!$AN$15","v":18355},{"$f":"'1a'!$AN$15","v":18355},{"$f":"'1a'!$AN$15","v":18355},{"$f":"'1a'!$AN$15","v":18355},{"$f":"'1a'!$AN$15","v":18355}]
["High Court",{"$f":"'1a'!D27","v":390},{"$f":"'1a'!E27","v":390},{"$f":"'1a'!F27","v":390},{"$f":"'1a'!G27","v":386},{"$f":"'1a'!H27","v":375},{"$f":"'1a'!I27","v":360},{"$f":"'1a'!J27","v":335},{"$f":"'1a'!K27","v":291},{"$f":"'1a'!L27","v":250},{"$f":"'1a'!M27","v":215},{"$f":"'1a'!N27","v":247},{"$f":"'1a'!O27","v":267},{"$f":"'1a'!P27","v":292},{"$f":"'1a'!Q27","v":304},{"$f":"'1a'!R27","v":313},{"$f":"'1a'!S27","v":325},{"$f":"'1a'!T27","v":432},{"$f":"'1a'!U27","v":385},{"$f":"'1a'!V27","v":444},{"$f":"'1a'!W27","v":476},{"$f":"'1a'!X27","v":516},{"$f":"'1a'!Y27","v":534},{"$f":"'1a'!Z27","v":535},{"$f":"'1a'!AA27","v":560},{"$f":"'1a'!AB27","v":609},{"$f":"'1a'!AC27","v":613},{"$f":"'1a'!AD27","v":613},{"$f":"'1a'!AE27","v":637},{"$f":"'1a'!AF27","v":636},{"$f":"'1a'!AG27","v":641},{"$f":"'1a'!AH27","v":657},{"$f":"'1a'!AI27","v":654},{"$f":"'1a'!AJ27","v":698}]
["High Court (as at end of 2019/20)",{"$f":"'1a'!$AN$27","v":390},{"$f":"'1a'!$AN$27","v":390},{"$f":"'1a'!$AN$27","v":390},{"$f":"'1a'!$AN$27","v":390},{"$f":"'1a'!$AN$27","v":390},{"$f":"'1a'!$AN$27","v":390},{"$f":"'1a'!$AN$27","v":390},{"$f":"'1a'!$AN$27","v":390},{"$f":"'1a'!$AN$27","v":390},{"$f":"'1a'!$AN$27","v":390},{"$f":"'1a'!$AN$27","v":390},{"$f":"'1a'!$AN$27","v":390},{"$f":"'1a'!$AN$27","v":390},{"$f":"'1a'!$AN$27","v":390},{"$f":"'1a'!$AN$27","v":390},{"$f":"'1a'!$AN$27","v":390},{"$f":"'1a'!$AN$27","v":390},{"$f":"'1a'!$AN$27","v":390},{"$f":"'1a'!$AN$27","v":390},{"$f":"'1a'!$AN$27","v":390},{"$f":"'1a'!$AN$27","v":390},{"$f":"'1a'!$AN$27","v":390},{"$f":"'1a'!$AN$27","v":390},{"$f":"'1a'!$AN$27","v":390},{"$f":"'1a'!$AN$27","v":390},{"$f":"'1a'!$AN$27","v":390},{"$f":"'1a'!$AN$27","v":390},{"$f":"'1a'!$AN$27","v":390},{"$f":"'1a'!$AN$27","v":390},{"$f":"'1a'!$AN$27","v":390},{"$f":"'1a'!$AN$27","v":390},{"$f":"'1a'!$AN$27","v":390},{"$f":"'1a'!$AN$27","v":390}]
["Sheriff Court - Solemn",{"$f":"'1a'!D40","v":497},{"$f":"'1a'!E40","v":497},{"$f":"'1a'!F40","v":497},{"$f":"'1a'!G40","v":497},{"$f":"'1a'!H40","v":553},{"$f":"'1a'!I40","v":613},{"$f":"'1a'!J40","v":648},{"$f":"'1a'!K40","v":738},{"$f":"'1a'!L40","v":939},{"$f":"'1a'!M40","v":1091},{"$f":"'1a'!N40","v":1211},{"$f":"'1a'!O40","v":1329},{"$f":"'1a'!P40","v":1398},{"$f":"'1a'!Q40","v":1479},{"$f":"'1a'!R40","v":1595},{"$f":"'1a'!S40","v":1684},{"$f":"'1a'!T40","v":1781},{"$f":"'1a'!U40","v":1842},{"$f":"'1a'!V40","v":1923},{"$f":"'1a'!W40","v":2053},{"$f":"'1a'!X40","v":2170},{"$f":"'1a'!Y40","v":2212},{"$f":"'1a'!Z40","v":2196},{"$f":"'1a'!AA40","v":2274},{"$f":"'1a'!AB40","v":2267},{"$f":"'1a'!AC40","v":2307},{"$f":"'1a'!AD40","v":2325},{"$f":"'1a'!AE40","v":2356},{"$f":"'1a'!AF40","v":2340},{"$f":"'1a'!AG40","v":2331},{"$f":"'1a'!AH40","v":2305},{"$f":"'1a'!AI40","v":2361},{"$f":"'1a'!AJ40","v":2438}]
["Sheriff Court - Solemn (as at end of 2019/20)",{"$f":"'1a'!$AN$40","v":497},{"$f":"'1a'!$AN$40","v":497},{"$f":"'1a'!$AN$40","v":497},{"$f":"'1a'!$AN$40","v":497},{"$f":"'1a'!$AN$40","v":497},{"$f":"'1a'!$AN$40","v":497},{"$f":"'1a'!$AN$40","v":497},{"$f":"'1a'!$AN$40","v":497},{"$f":"'1a'!$AN$40","v":497},{"$f":"'1a'!$AN$40","v":497},{"$f":"'1a'!$AN$40","v":497},{"$f":"'1a'!$AN$40","v":497},{"$f":"'1a'!$AN$40","v":497},{"$f":"'1a'!$AN$40","v":497},{"$f":"'1a'!$AN$40","v":497},{"$f":"'1a'!$AN$40","v":497},{"$f":"'1a'!$AN$40","v":497},{"$f":"'1a'!$AN$40","v":497},{"$f":"'1a'!$AN$40","v":497},{"$f":"'1a'!$AN$40","v":497},{"$f":"'1a'!$AN$40","v":497},{"$f":"'1a'!$AN$40","v":497},{"$f":"'1a'!$AN$40","v":497},{"$f":"'1a'!$AN$40","v":497},{"$f":"'1a'!$AN$40","v":497},{"$f":"'1a'!$AN$40","v":497},{"$f":"'1a'!$AN$40","v":497},{"$f":"'1a'!$AN$40","v":497},{"$f":"'1a'!$AN$40","v":497},{"$f":"'1a'!$AN$40","v":497},{"$f":"'1a'!$AN$40","v":497},{"$f":"'1a'!$AN$40","v":497},{"$f":"'1a'!$AN$40","v":497}]
["Sheriff Court - Summary",{"$f":"'1a'!D52","v":13967},{"$f":"'1a'!E52","v":15854},{"$f":"'1a'!F52","v":17818},{"$f":"'1a'!G52","v":20929},{"$f":"'1a'!H52","v":22932},{"$f":"'1a'!I52","v":25146},{"$f":"'1a'!J52","v":26370},{"$f":"'1a'!K52","v":27372},{"$f":"'1a'!L52","v":27723},{"$f":"'1a'!M52","v":28548},{"$f":"'1a'!N52","v":29324},{"$f":"'1a'!O52","v":30645},{"$f":"'1a'!P52","v":31799},{"$f":"'1a'!Q52","v":32778},{"$f":"'1a'!R52","v":33598},{"$f":"'1a'!S52","v":33602},{"$f":"'1a'!T52","v":33369},{"$f":"'1a'!U52","v":32433},{"$f":"'1a'!V52","v":32448},{"$f":"'1a'!W52","v":33015},{"$f":"'1a'!X52","v":32394},{"$f":"'1a'!Y52","v":32759},{"$f":"'1a'!Z52","v":31904},{"$f":"'1a'!AA52","v":30520},{"$f":"'1a'!AB52","v":29793},{"$f":"'1a'!AC52","v":28500},{"$f":"'1a'!AD52","v":27525},{"$f":"'1a'!AE52","v":26802},{"$f":"'1a'!AF52","v":25595},{"$f":"'1a'!AG52","v":24700},{"$f":"'1a'!AH52","v":23214},{"$f":"'1a'!AI52","v":22580},{"$f":"'1a'!AJ52","v":22235}]
["Sheriff Court - Summary (as at end of 2019/20)",{"$f":"'1a'!$AN$52","v":13971},{"$f":"'1a'!$AN$52","v":13971},{"$f":"'1a'!$AN$52","v":13971},{"$f":"'1a'!$AN$52","v":13971},{"$f":"'1a'!$AN$52","v":13971},{"$f":"'1a'!$AN$52","v":13971},{"$f":"'1a'!$AN$52","v":13971},{"$f":"'1a'!$AN$52","v":13971},{"$f":"'1a'!$AN$52","v":13971},{"$f":"'1a'!$AN$52","v":13971},{"$f":"'1a'!$AN$52","v":13971},{"$f":"'1a'!$AN$52","v":13971},{"$f":"'1a'!$AN$52","v":13971},{"$f":"'1a'!$AN$52","v":13971},{"$f":"'1a'!$AN$52","v":13971},{"$f":"'1a'!$AN$52","v":13971},{"$f":"'1a'!$AN$52","v":13971},{"$f":"'1a'!$AN$52","v":13971},{"$f":"'1a'!$AN$52","v":13971},{"$f":"'1a'!$AN$52","v":13971},{"$f":"'1a'!$AN$52","v":13971},{"$f":"'1a'!$AN$52","v":13971},{"$f":"'1a'!$AN$52","v":13971},{"$f":"'1a'!$AN$52","v":13971},{"$f":"'1a'!$AN$52","v":13971},{"$f":"'1a'!$AN$52","v":13971},{"$f":"'1a'!$AN$52","v":13971},{"$f":"'1a'!$AN$52","v":13971},{"$f":"'1a'!$AN$52","v":13971},{"$f":"'1a'!$AN$52","v":13971},{"$f":"'1a'!$AN$52","v":13971},{"$f":"'1a'!$AN$52","v":13971},{"$f":"'1a'!$AN$52","v":13971}]
["Justice of the Peace Court - Summary",{"$f":"'1a'!D64","v":3220},{"$f":"'1a'!E64","v":3495},{"$f":"'1a'!F64","v":3732},{"$f":"'1a'!G64","v":4088},{"$f":"'1a'!H64","v":4491},{"$f":"'1a'!I64","v":4837},{"$f":"'1a'!J64","v":5074},{"$f":"'1a'!K64","v":5189},{"$f":"'1a'!L64","v":5371},{"$f":"'1a'!M64","v":5213},{"$f":"'1a'!N64","v":5255},{"$f":"'1a'!O64","v":5560},{"$f":"'1a'!P64","v":5999},{"$f":"'1a'!Q64","v":6321},{"$f":"'1a'!R64","v":6945},{"$f":"'1a'!S64","v":7730},{"$f":"'1a'!T64","v":7944},{"$f":"'1a'!U64","v":7890},{"$f":"'1a'!V64","v":7941},{"$f":"'1a'!W64","v":8053},{"$f":"'1a'!X64","v":7936},{"$f":"'1a'!Y64","v":8101},{"$f":"'1a'!Z64","v":7868},{"$f":"'1a'!AA64","v":7569},{"$f":"'1a'!AB64","v":7289},{"$f":"'1a'!AC64","v":7079},{"$f":"'1a'!AD64","v":6711},{"$f":"'1a'!AE64","v":6389},{"$f":"'1a'!AF64","v":6163},{"$f":"'1a'!AG64","v":5922},{"$f":"'1a'!AH64","v":5386},{"$f":"'1a'!AI64","v":4993},{"$f":"'1a'!AJ64","v":4934}]
["Justice of the Peace Court - Summary (as at end of 2019/20)",{"$f":"'1a'!$AN$64","v":3497},{"$f":"'1a'!$AN$64","v":3497},{"$f":"'1a'!$AN$64","v":3497},{"$f":"'1a'!$AN$64","v":3497},{"$f":"'1a'!$AN$64","v":3497},{"$f":"'1a'!$AN$64","v":3497},{"$f":"'1a'!$AN$64","v":3497},{"$f":"'1a'!$AN$64","v":3497},{"$f":"'1a'!$AN$64","v":3497},{"$f":"'1a'!$AN$64","v":3497},{"$f":"'1a'!$AN$64","v":3497},{"$f":"'1a'!$AN$64","v":3497},{"$f":"'1a'!$AN$64","v":3497},{"$f":"'1a'!$AN$64","v":3497},{"$f":"'1a'!$AN$64","v":3497},{"$f":"'1a'!$AN$64","v":3497},{"$f":"'1a'!$AN$64","v":3497},{"$f":"'1a'!$AN$64","v":3497},{"$f":"'1a'!$AN$64","v":3497},{"$f":"'1a'!$AN$64","v":3497},{"$f":"'1a'!$AN$64","v":3497},{"$f":"'1a'!$AN$64","v":3497},{"$f":"'1a'!$AN$64","v":3497},{"$f":"'1a'!$AN$64","v":3497},{"$f":"'1a'!$AN$64","v":3497},{"$f":"'1a'!$AN$64","v":3497},{"$f":"'1a'!$AN$64","v":3497},{"$f":"'1a'!$AN$64","v":3497},{"$f":"'1a'!$AN$64","v":3497},{"$f":"'1a'!$AN$64","v":3497},{"$f":"'1a'!$AN$64","v":3497},{"$f":"'1a'!$AN$64","v":3497},{"$f":"'1a'!$AN$64","v":3497}]
[]
[]
[]
[]
[]
[]
[]
[]
[]
[]
["This data is only for The Scottish Courts and Tribunals Service Internal use. Please go to the index tab and navigate as required."]

{"sheet":"High Court Raw Data","index":7,"n_rows":7,"n_cols":23,"rows_kept":7,"cut":false,"hidden":true,"merged":[]}
["This data is only for The Scottish Courts and Tribunals Service Internal use. Please go to the index tab and navigate as required."]
["FINANCIAL_YEAR","QUARTER","COURT_REF","COURT_NAME","INDICTMENTS_REG","INDICTMENTS_PH","INDICTMENTS_CALLED_CPH","S76_INDICTMENTS","TRIALS_CALLED","TRIALS_ELED","TRIALS_LOCT","TRIALS_OUTSTANDING","SOL_CASES_FULLY_DISPOSED",null,null,"Current Year","Current Quarter"]
["2019/20","Q1",2,"HIGH CT",248,253,100,25,168,107,5,315,182,null,null,{"$f":"LOOKUP(2,1/($A:$A<>\"\"),$A:$A)","v":"2020/21"},{"$f":"LOOKUP(2,1/($B:$B<>\"\"),$B:$B)","v":"Q1"},null,"2019/20","Q4",null,"2018/19","Q4"]
["2019/20","Q2",2,"HIGH CT",272,241,114,22,219,146,4,304,241]
["2019/20","Q3",2,"HIGH CT",274,267,115,24,190,120,22,369,206]
["2019/20","Q4",2,"HIGH CT",230,220,108,23,235,125,18,390,177]
["2020/21","Q1",2,"HIGH CT",231,92,40,17,0,0,0,390,30]

{"sheet":"High Court Chart Data","index":8,"n_rows":10,"n_cols":15,"rows_kept":10,"cut":false,"hidden":true,"merged":[]}
["Financial Year","QUARTER","COURT_REF","COURT","INDICTMENTS_REG","INDICTMENTS_PH","INDICTMENTS_CALLED_CPH","S76_INDICTMENTS","TRIALS_CALLED","TRIALS_ELED","TRIALS_LOCT","% LOCT1","TRIALS_OUTSTANDING","SOL_CASES_FULLY_DISPOSED","% LOCT"]
["2019/20","Q1",2,"HIGH CT",248,253,100,25,168,107,5,{"$f":"IFERROR(HighChart[[#This Row],[TRIALS_LOCT]]/HighChart[[#This Row],[TRIALS_CALLED]],NA())","v":2.976190476190476E-2},315,182,{"$f":"IF(I2=0,0,K2/I2)","v":2.976190476190476E-2}]
["2019/20","Q2",2,"HIGH CT",272,241,114,22,219,146,4,{"$f":"IFERROR(HighChart[[#This Row],[TRIALS_LOCT]]/HighChart[[#This Row],[TRIALS_CALLED]],NA())","v":1.8264840182648401E-2},304,241,1.8264840182648401E-2]
["2019/20","Q3",2,"HIGH CT",274,267,115,24,190,120,22,{"$f":"IFERROR(HighChart[[#This Row],[TRIALS_LOCT]]/HighChart[[#This Row],[TRIALS_CALLED]],NA())","v":0.11578947368421053},369,206,0.11578947368421053]
["2019/20","Q4",2,"HIGH CT",230,220,108,23,235,125,18,{"$f":"IFERROR(HighChart[[#This Row],[TRIALS_LOCT]]/HighChart[[#This Row],[TRIALS_CALLED]],NA())","v":7.6595744680851063E-2},390,177,7.6595744680851063E-2]
["2020/21 YTD","Q1",2,"HIGH CT",231,92,40,17,0,0,0,{"$f":"IFERROR(HighChart[[#This Row],[TRIALS_LOCT]]/HighChart[[#This Row],[TRIALS_CALLED]],NA())","v":{"$error":"#N/A"}},390,30,0]
["2020/21 YTD","Q2",null,null,null,null,null,null,null,null,null,{"$f":"IFERROR(HighChart[[#This Row],[TRIALS_LOCT]]/HighChart[[#This Row],[TRIALS_CALLED]],NA())","v":{"$error":"#N/A"}},null,null,{"$f":"IF(I7=0,0,K7/I7)","v":0}]
["2020/21 YTD","Q3",null,null,null,null,null,null,null,null,null,{"$f":"IFERROR(HighChart[[#This Row],[TRIALS_LOCT]]/HighChart[[#This Row],[TRIALS_CALLED]],NA())","v":{"$error":"#N/A"}},null,null,0]
["2020/21 YTD","Q4",null,null,null,null,null,null,null,null,null,{"$f":"IFERROR(HighChart[[#This Row],[TRIALS_LOCT]]/HighChart[[#This Row],[TRIALS_CALLED]],NA())","v":{"$error":"#N/A"}},null,null,{"$f":"IF(I9=0,0,K9/I9)","v":0}]
["This data is only for The Scottish Courts and Tribunals Service Internal use. Please go to the index tab and navigate as required."]

{"sheet":"JP SC Raw Data","index":9,"n_rows":378,"n_cols":34,"rows_kept":378,"cut":false,"hidden":true,"merged":[]}
[null,"This data is only for The Scottish Courts and Tribunals Service Internal use. Please go to the index tab and navigate as required.",null,null,null,null,null,null,null,null,null,null,null,null,null,null,null,null,null,null,null,null,null,null,null,null,"Current Year","Current Quarter",null,"Previous year 2019/20",null,null,"Previous year 2018/19"]
[null,null,null,null,null,null,null,null,null,null,null,null,null,null,null,null,null,null,null,null,null,null,null,null,null,null,{"$f":"LOOKUP(2,1/($B:$B<>\"\"),$B:$B)","v":"2020/21"},{"$f":"LOOKUP(2,1/($C:$C<>\"\"),$C:$C)","v":"Q1"},null,"2019/20","Q4",null,"2018/19","Q4"]
["Sheriffdom","FINANCIAL_YEAR","QUARTER","COURT_REF","COURT_NAME","COURT_TYPE","SOL_PETITIONS","SOL_INDICTMENTS_REGISTERED","SOL_FIRST_DIET","SOL_CONT_FD","SOL_S76","SOL_TRIALS_CALLED","SOL_TRIAL_ELED","SOL_LOCT","SOL_OUTSTANDING_INDICTMENTS","SOL_CASES_FULLY_DISPOSED","SUM_COMPLAINTS_REGISTERED","SUM_CALLED_FOR_FIRST_TIME","SUM_CWP_HEARING","SUM_INTERMEDIATE_DIET","SUM_TRIALS_CALLED","SUM_TRIAL_ELED","SUM_LOCT","SUM_OUTSTANDING_COMPLAINTS","SUM_CASES_FULLY_DISPOSED"]
[{"$f":"VLOOKUP(D4,'Sheriffdom Look up'!$A$1:$E$102,5,FALSE)","v":"National JP"},"2019/20","Q1",1,"NATIONAL","J",0,0,0,0,0,0,0,0,0,0,7496,7329,4505,5139,2668,438,43,3640,7288]
[{"$f":"VLOOKUP(D5,'Sheriffdom Look up'!$A$1:$E$102,5,FALSE)","v":"National SC"},"2019/20","Q1",0,"NATIONAL","S",2502,1385,1241,699,246,835,299,19,449,1282,15912,15203,3666,16190,9818,1832,345,12088,14291]
[{"$f":"VLOOKUP(D6,'Sheriffdom Look up'!$A$1:$E$102,5,FALSE)","v":"Tayside Central & Fife"},"2019/20","Q1",9240,"ALLOA","J",0,0,0,0,0,0,0,0,0,0,41,35,50,40,14,4,0,18,46]
[{"$f":"VLOOKUP(D7,'Sheriffdom Look up'!$A$1:$E$102,5,FALSE)","v":"South Strathclyde, Dumfries & Galloway"},"2019/20","Q1",9246,"DUMFRIES","J",0,0,0,0,0,0,0,0,0,0,549,573,253,149,53,19,0,112,506]
[{"$f":"VLOOKUP(D8,'Sheriffdom Look up'!$A$1:$E$102,5,FALSE)","v":"South Strathclyde, Dumfries & Galloway"},"2019/20","Q1",9250,"STRANRAER","J",0,0,0,0,0,0,0,0,0,0,218,263,111,51,22,6,1,50,234]
[{"$f":"VLOOKUP(D9,'Sheriffdom Look up'!$A$1:$E$102,5,FALSE)","v":"Grampian Highland & Islands"},"2019/20","Q1",9251,"ABERDEEN","J",0,0,0,0,0,0,0,0,0,0,579,609,432,327,127,24,7,274,605]
[{"$f":"VLOOKUP(D10,'Sheriffdom Look up'!$A$1:$E$102,5,FALSE)","v":"Grampian Highland & Islands"},"2019/20","Q1",9252,"BANFF","J",0,0,0,0,0,0,0,0,0,0,30,30,40,13,12,5,0,28,34]
[{"$f":"VLOOKUP(D11,'Sheriffdom Look up'!$A$1:$E$102,5,FALSE)","v":"Grampian Highland & Islands"},"2019/20","Q1",9253,"PETERHEAD","J",0,0,0,0,0,0,0,0,0,0,99,99,76,54,30,9,0,44,106]
[{"$f":"VLOOKUP(D12,'Sheriffdom Look up'!$A$1:$E$102,5,FALSE)","v":"Tayside Central & Fife"},"2019/20","Q1",9256,"DUNDEE","J",0,0,0,0,0,0,0,0,0,0,260,264,217,155,73,16,0,61,277]
[{"$f":"VLOOKUP(D13,'Sheriffdom Look up'!$A$1:$E$102,5,FALSE)","v":"North Strathclyde"},"2019/20","Q1",9261,"KILMARNOCK","J",0,0,0,0,0,0,0,0,0,0,256,223,132,159,67,13,2,110,226]
[{"$f":"VLOOKUP(D14,'Sheriffdom Look up'!$A$1:$E$102,5,FALSE)","v":"Tayside Central & Fife"},"2019/20","Q1",9264,"FORFAR","J",0,0,0,0,0,0,0,0,0,0,135,122,49,63,35,6,0,51,99]
[{"$f":"VLOOKUP(D15,'Sheriffdom Look up'!$A$1:$E$102,5,FALSE)","v":"Lothian & Borders"},"2019/20","Q1",9278,"EDINBURGH","J",0,0,0,0,0,0,0,0,0,0,813,827,552,663,282,25,3,408,772]
[{"$f":"VLOOKUP(D16,'Sheriffdom Look up'!$A$1:$E$102,5,FALSE)","v":"Tayside Central & Fife"},"2019/20","Q1",9282,"FALKIRK","J",0,0,0,0,0,0,0,0,0,0,140,134,110,122,51,10,0,76,144]
[{"$f":"VLOOKUP(D17,'Sheriffdom Look up'!$A$1:$E$102,5,FALSE)","v":"Tayside Central & Fife"},"2019/20","Q1",9286,"DUNFERMLINE","J",0,0,0,0,0,0,0,0,0,0,104,79,68,102,38,11,1,35,119]
[{"$f":"VLOOKUP(D18,'Sheriffdom Look up'!$A$1:$E$102,5,FALSE)","v":"Tayside Central & Fife"},"2019/20","Q1",9287,"KIRKCALDY","J",0,0,0,0,0,0,0,0,0,0,202,206,207,186,70,17,1,128,211]
[{"$f":"VLOOKUP(D19,'Sheriffdom Look up'!$A$1:$E$102,5,FALSE)","v":"North Strathclyde"},"2019/20","Q1",9289,"CAMPBELTOWN","J",0,0,0,0,0,0,0,0,0,0,12,12,3,2,3,2,0,3,10]
[{"$f":"VLOOKUP(D20,'Sheriffdom Look up'!$A$1:$E$102,5,FALSE)","v":"North Strathclyde"},"2019/20","Q1",9290,"DUNOON","J",0,0,0,0,0,0,0,0,0,0,28,28,13,7,5,0,0,5,21]
[{"$f":"VLOOKUP(D21,'Sheriffdom Look up'!$A$1:$E$102,5,FALSE)","v":"North Strathclyde"},"2019/20","Q1",9292,"LOCHGILPHEAD","J",0,0,0,0,0,0,0,0,0,0,15,15,4,8,7,0,0,4,16]
[{"$f":"VLOOKUP(D22,'Sheriffdom Look up'!$A$1:$E$102,5,FALSE)","v":"North Strathclyde"},"2019/20","Q1",9293,"OBAN","J",0,0,0,0,0,0,0,0,0,0,17,15,10,4,2,0,0,3,10]
[{"$f":"VLOOKUP(D23,'Sheriffdom Look up'!$A$1:$E$102,5,FALSE)","v":"Glasgow & Strathkelvin"},"2019/20","Q1",9295,"GLASGOW","J",0,0,0,0,0,0,0,0,0,0,1226,1221,470,1109,842,93,7,952,1414]
[{"$f":"VLOOKUP(D24,'Sheriffdom Look up'!$A$1:$E$102,5,FALSE)","v":"North Strathclyde"},"2019/20","Q1",9340,"GREENOCK","J",0,0,0,0,0,0,0,0,0,0,81,72,79,72,48,6,0,70,79]
[{"$f":"VLOOKUP(D25,'Sheriffdom Look up'!$A$1:$E$102,5,FALSE)","v":"Grampian Highland & Islands"},"2019/20","Q1",9341,"ELGIN","J",0,0,0,0,0,0,0,0,0,0,155,117,81,83,26,3,0,59,98]
[{"$f":"VLOOKUP(D26,'Sheriffdom Look up'!$A$1:$E$102,5,FALSE)","v":"North Strathclyde"},"2019/20","Q1",9342,"PAISLEY","J",0,0,0,0,0,0,0,0,0,0,267,243,156,250,181,23,6,184,271]
[{"$f":"VLOOKUP(D27,'Sheriffdom Look up'!$A$1:$E$102,5,FALSE)","v":"Grampian Highland & Islands"},"2019/20","Q1",9345,"FORT WILLIAM","J",0,0,0,0,0,0,0,0,0,0,71,69,53,22,11,4,0,17,62]
[{"$f":"VLOOKUP(D28,'Sheriffdom Look up'!$A$1:$E$102,5,FALSE)","v":"Grampian Highland & Islands"},"2019/20","Q1",9346,"INVERNESS","J",0,0,0,0,0,0,0,0,0,0,307,316,217,226,94,18,0,147,367]
[{"$f":"VLOOKUP(D29,'Sheriffdom Look up'!$A$1:$E$102,5,FALSE)","v":"Grampian Highland & Islands"},"2019/20","Q1",9348,"TAIN","J",0,0,0,0,0,0,0,0,0,0,93,72,47,21,7,2,0,29,57]
[{"$f":"VLOOKUP(D30,'Sheriffdom Look up'!$A$1:$E$102,5,FALSE)","v":"Lothian & Borders"},"2019/20","Q1",9351,"JEDBURGH","J",0,0,0,0,0,0,0,0,0,0,32,40,22,19,8,5,0,10,34]
[{"$f":"VLOOKUP(D31,'Sheriffdom Look up'!$A$1:$E$102,5,FALSE)","v":"Lothian & Borders"},"2019/20","Q1",9353,"SELKIRK","J",0,0,0,0,0,0,0,0,0,0,94,73,13,18,8,2,0,7,64]
[{"$f":"VLOOKUP(D32,'Sheriffdom Look up'!$A$1:$E$102,5,FALSE)","v":"South Strathclyde, Dumfries & Galloway"},"2019/20","Q1",9355,"AIRDRIE","J",0,0,0,0,0,0,0,0,0,0,228,250,172,163,84,23,1,121,199]
[{"$f":"VLOOKUP(D33,'Sheriffdom Look up'!$A$1:$E$102,5,FALSE)","v":"Tayside Central & Fife"},"2019/20","Q1",9358,"PERTH","J",0,0,0,0,0,0,0,0,0,0,343,300,200,100,56,11,4,109,284]
[{"$f":"VLOOKUP(D34,'Sheriffdom Look up'!$A$1:$E$102,5,FALSE)","v":"South Strathclyde, Dumfries & Galloway"},"2019/20","Q1",9360,"AYR","J",0,0,0,0,0,0,0,0,0,0,143,154,102,124,51,18,2,49,148]
[{"$f":"VLOOKUP(D35,'Sheriffdom Look up'!$A$1:$E$102,5,FALSE)","v":"South Strathclyde, Dumfries & Galloway"},"2019/20","Q1",9366,"HAMILTON","J",0,0,0,0,0,0,0,0,0,0,485,428,219,450,213,41,4,283,344]
[{"$f":"VLOOKUP(D36,'Sheriffdom Look up'!$A$1:$E$102,5,FALSE)","v":"South Strathclyde, Dumfries & Galloway"},"2019/20","Q1",9367,"LANARK","J",0,0,0,0,0,0,0,0,0,0,56,55,38,69,37,4,0,25,70]
[{"$f":"VLOOKUP(D37,'Sheriffdom Look up'!$A$1:$E$102,5,FALSE)","v":"Tayside Central & Fife"},"2019/20","Q1",9372,"STIRLING","J",0,0,0,0,0,0,0,0,0,0,90,89,109,63,32,8,1,36,98]
[{"$f":"VLOOKUP(D38,'Sheriffdom Look up'!$A$1:$E$102,5,FALSE)","v":"North Strathclyde"},"2019/20","Q1",9376,"DUMBARTON","J",0,0,0,0,0,0,0,0,0,0,171,160,93,94,46,4,0,92,132]
[{"$f":"VLOOKUP(D39,'Sheriffdom Look up'!$A$1:$E$102,5,FALSE)","v":"Lothian & Borders"},"2019/20","Q1",9380,"LIVINGSTON","J",0,0,0,0,0,0,0,0,0,0,156,136,107,151,33,6,3,40,131]
[{"$f":"VLOOKUP(D40,'Sheriffdom Look up'!$A$1:$E$102,5,FALSE)","v":"Grampian Highland & Islands"},"2019/20","Q1",9701,"ABERDEEN","S",160,107,100,46,34,59,24,2,50,107,1127,1069,356,1134,506,131,36,1042,882]
[{"$f":"VLOOKUP(D41,'Sheriffdom Look up'!$A$1:$E$102,5,FALSE)","v":"South Strathclyde, Dumfries & Galloway"},"2019/20","Q1",9702,"AIRDRIE","S",73,27,43,31,8,38,16,0,23,44,626,596,133,757,445,109,4,366,592]
[{"$f":"VLOOKUP(D42,'Sheriffdom Look up'!$A$1:$E$102,5,FALSE)","v":"Tayside Central & Fife"},"2019/20","Q1",9703,"ALLOA","S",25,0,0,0,0,0,0,0,0,1,194,180,63,211,100,17,11,157,141]
[{"$f":"VLOOKUP(D43,'Sheriffdom Look up'!$A$1:$E$102,5,FALSE)","v":"South Strathclyde, Dumfries & Galloway"},"2019/20","Q1",9704,"AYR","S",64,41,39,27,8,31,7,0,17,41,517,437,94,484,215,57,8,262,413]
[{"$f":"VLOOKUP(D44,'Sheriffdom Look up'!$A$1:$E$102,5,FALSE)","v":"Grampian Highland & Islands"},"2019/20","Q1",9711,"BANFF","S",2,0,0,0,0,0,0,0,0,0,34,29,23,58,43,9,6,56,38]
[{"$f":"VLOOKUP(D45,'Sheriffdom Look up'!$A$1:$E$102,5,FALSE)","v":"North Strathclyde"},"2019/20","Q1",9716,"CAMPBELTOWN","S",1,1,1,1,0,0,0,0,1,0,25,24,3,28,17,4,1,23,29]
[{"$f":"VLOOKUP(D46,'Sheriffdom Look up'!$A$1:$E$102,5,FALSE)","v":"North Strathclyde"},"2019/20","Q1",9723,"DUMBARTON","S",62,42,31,22,9,34,11,1,11,41,335,338,64,383,245,48,23,307,304]
[{"$f":"VLOOKUP(D47,'Sheriffdom Look up'!$A$1:$E$102,5,FALSE)","v":"South Strathclyde, Dumfries & Galloway"},"2019/20","Q1",9724,"DUMFRIES","S",44,27,22,7,3,14,6,0,7,23,372,362,54,250,183,66,0,205,391]
[{"$f":"VLOOKUP(D48,'Sheriffdom Look up'!$A$1:$E$102,5,FALSE)","v":"Tayside Central & Fife"},"2019/20","Q1",9726,"DUNDEE","S",136,98,87,32,20,64,21,1,36,90,672,593,173,666,448,83,3,529,650]
[{"$f":"VLOOKUP(D49,'Sheriffdom Look up'!$A$1:$E$102,5,FALSE)","v":"Tayside Central & Fife"},"2019/20","Q1",9727,"DUNFERMLINE","S",58,32,37,29,6,16,6,1,11,32,340,353,102,393,187,30,12,276,373]
[{"$f":"VLOOKUP(D50,'Sheriffdom Look up'!$A$1:$E$102,5,FALSE)","v":"North Strathclyde"},"2019/20","Q1",9728,"DUNOON","S",5,0,3,2,0,4,1,0,0,4,70,69,26,46,43,13,0,53,55]
[{"$f":"VLOOKUP(D51,'Sheriffdom Look up'!$A$1:$E$102,5,FALSE)","v":"Lothian & Borders"},"2019/20","Q1",9741,"EDINBURGH","S",318,198,174,148,26,92,30,0,47,148,2028,1860,442,1908,1073,98,12,1542,1500]
[{"$f":"VLOOKUP(D52,'Sheriffdom Look up'!$A$1:$E$102,5,FALSE)","v":"Grampian Highland & Islands"},"2019/20","Q1",9742,"ELGIN","S",49,19,21,22,3,7,1,0,6,19,224,212,75,237,101,19,5,172,194]
[{"$f":"VLOOKUP(D53,'Sheriffdom Look up'!$A$1:$E$102,5,FALSE)","v":"Tayside Central & Fife"},"2019/20","Q1",9751,"FALKIRK","S",70,21,25,35,10,27,10,2,15,37,483,469,115,491,284,39,11,321,436]
[{"$f":"VLOOKUP(D54,'Sheriffdom Look up'!$A$1:$E$102,5,FALSE)","v":"Tayside Central & Fife"},"2019/20","Q1",9752,"FORFAR","S",48,0,0,0,0,0,0,0,0,1,261,258,62,261,142,28,15,214,246]
[{"$f":"VLOOKUP(D55,'Sheriffdom Look up'!$A$1:$E$102,5,FALSE)","v":"Grampian Highland & Islands"},"2019/20","Q1",9753,"FORT WILLIAM","S",3,2,0,0,2,0,0,0,0,0,63,55,33,68,33,9,5,58,51]
[{"$f":"VLOOKUP(D56,'Sheriffdom Look up'!$A$1:$E$102,5,FALSE)","v":"Glasgow & Strathkelvin"},"2019/20","Q1",9761,"GLASGOW","S",438,330,247,56,42,175,63,0,109,245,2637,2716,395,2668,2497,392,67,2271,2683]
[{"$f":"VLOOKUP(D57,'Sheriffdom Look up'!$A$1:$E$102,5,FALSE)","v":"North Strathclyde"},"2019/20","Q1",9762,"GREENOCK","S",46,17,21,5,2,8,4,0,8,16,232,223,55,273,157,41,12,199,203]
[{"$f":"VLOOKUP(D58,'Sheriffdom Look up'!$A$1:$E$102,5,FALSE)","v":"South Strathclyde, Dumfries & Galloway"},"2019/20","Q1",9772,"HAMILTON","S",172,97,80,36,6,64,26,4,22,76,1138,1036,133,1050,647,148,10,852,945]
[{"$f":"VLOOKUP(D59,'Sheriffdom Look up'!$A$1:$E$102,5,FALSE)","v":"Grampian Highland & Islands"},"2019/20","Q1",9781,"INVERNESS","S",66,49,43,41,8,9,3,0,6,39,409,373,137,494,177,19,3,327,345]
[{"$f":"VLOOKUP(D60,'Sheriffdom Look up'!$A$1:$E$102,5,FALSE)","v":"Lothian & Borders"},"2019/20","Q1",9791,"JEDBURGH","S",20,7,8,12,4,0,0,0,4,9,99,102,13,130,87,8,2,68,116]
[{"$f":"VLOOKUP(D61,'Sheriffdom Look up'!$A$1:$E$102,5,FALSE)","v":"North Strathclyde"},"2019/20","Q1",9801,"KILMARNOCK","S",130,66,52,19,13,40,18,2,12,69,730,650,92,560,361,79,14,443,676]
[{"$f":"VLOOKUP(D62,'Sheriffdom Look up'!$A$1:$E$102,5,FALSE)","v":"Tayside Central & Fife"},"2019/20","Q1",9803,"KIRKCALDY","S",107,41,24,12,17,30,12,4,9,42,610,580,231,659,343,73,13,469,571]
[{"$f":"VLOOKUP(D63,'Sheriffdom Look up'!$A$1:$E$102,5,FALSE)","v":"Grampian Highland & Islands"},"2019/20","Q1",9805,"KIRKWALL","S",6,2,3,4,0,0,0,0,2,1,46,50,18,27,25,9,4,19,53]
[{"$f":"VLOOKUP(D64,'Sheriffdom Look up'!$A$1:$E$102,5,FALSE)","v":"South Strathclyde, Dumfries & Galloway"},"2019/20","Q1",9811,"LANARK","S",27,6,5,4,0,7,1,0,1,6,127,120,33,121,70,18,8,93,112]
[{"$f":"VLOOKUP(D65,'Sheriffdom Look up'!$A$1:$E$102,5,FALSE)","v":"Grampian Highland & Islands"},"2019/20","Q1",9812,"LERWICK","S",9,5,2,0,3,3,0,0,0,6,68,63,30,21,14,3,0,18,42]
[{"$f":"VLOOKUP(D66,'Sheriffdom Look up'!$A$1:$E$102,5,FALSE)","v":"Grampian Highland & Islands"},"2019/20","Q1",9814,"LOCHMADDY","S",1,0,1,0,0,0,0,0,1,0,7,7,4,2,1,0,0,8,1]
[{"$f":"VLOOKUP(D67,'Sheriffdom Look up'!$A$1:$E$102,5,FALSE)","v":"Lothian & Borders"},"2019/20","Q1",9815,"LIVINGSTON","S",80,26,40,24,5,12,2,0,4,38,432,385,147,613,260,41,21,260,404]
[{"$f":"VLOOKUP(D68,'Sheriffdom Look up'!$A$1:$E$102,5,FALSE)","v":"North Strathclyde"},"2019/20","Q1",9841,"OBAN","S",3,0,2,1,0,4,1,2,2,2,62,61,13,34,24,6,0,39,47]
[{"$f":"VLOOKUP(D69,'Sheriffdom Look up'!$A$1:$E$102,5,FALSE)","v":"North Strathclyde"},"2019/20","Q1",9851,"PAISLEY","S",93,39,53,39,2,45,18,0,16,62,624,612,121,834,489,78,10,445,622]
[{"$f":"VLOOKUP(D70,'Sheriffdom Look up'!$A$1:$E$102,5,FALSE)","v":"Tayside Central & Fife"},"2019/20","Q1",9853,"PERTH","S",69,40,25,6,5,21,10,0,12,32,343,349,98,424,183,68,13,348,305]
[{"$f":"VLOOKUP(D71,'Sheriffdom Look up'!$A$1:$E$102,5,FALSE)","v":"Grampian Highland & Islands"},"2019/20","Q1",9854,"PETERHEAD","S",47,0,0,0,0,0,0,0,0,0,283,274,74,176,96,22,9,198,222]
[{"$f":"VLOOKUP(D72,'Sheriffdom Look up'!$A$1:$E$102,5,FALSE)","v":"Grampian Highland & Islands"},"2019/20","Q1",9855,"PORTREE","S",2,1,1,0,0,0,0,0,0,0,19,32,29,16,12,2,0,22,21]
[{"$f":"VLOOKUP(D73,'Sheriffdom Look up'!$A$1:$E$102,5,FALSE)","v":"Lothian & Borders"},"2019/20","Q1",9871,"SELKIRK","S",8,3,6,4,1,3,1,0,3,6,131,121,20,108,70,8,4,100,107]
[{"$f":"VLOOKUP(D74,'Sheriffdom Look up'!$A$1:$E$102,5,FALSE)","v":"Tayside Central & Fife"},"2019/20","Q1",9872,"STIRLING","S",23,27,33,23,4,27,6,0,13,34,209,210,101,231,107,26,1,171,179]
[{"$f":"VLOOKUP(D75,'Sheriffdom Look up'!$A$1:$E$102,5,FALSE)","v":"Grampian Highland & Islands"},"2019/20","Q1",9874,"STORNOWAY","S",10,3,1,1,2,0,0,0,0,0,52,55,30,39,11,1,0,19,47]
[{"$f":"VLOOKUP(D76,'Sheriffdom Look up'!$A$1:$E$102,5,FALSE)","v":"South Strathclyde, Dumfries & Galloway"},"2019/20","Q1",9875,"STRANRAER","S",16,3,4,3,2,0,0,0,0,5,110,112,21,118,54,13,0,58,126]
[{"$f":"VLOOKUP(D77,'Sheriffdom Look up'!$A$1:$E$102,5,FALSE)","v":"Grampian Highland & Islands"},"2019/20","Q1",9881,"TAIN","S",8,0,0,0,0,0,0,0,0,0,94,85,18,138,32,7,2,50,78]
[{"$f":"VLOOKUP(D78,'Sheriffdom Look up'!$A$1:$E$102,5,FALSE)","v":"Grampian Highland & Islands"},"2019/20","Q1",9891,"WICK","S",3,8,7,7,1,1,1,0,1,6,79,83,35,79,36,10,0,28,91]
["National JP","2019/20","Q2",1,"National","J",0,0,0,0,0,0,0,0,0,0,8334,8168,4574,5062,2440,362,61,3452,7586]
["National SC","2019/20","Q2",0,"National","S",2506,1327,1288,773,278,792,291,9,488,1337,16793,15711,3536,17649,9787,1734,287,13186,14348]
[{"$f":"VLOOKUP(D81,'Sheriffdom Look up'!$A$1:$E$102,5,FALSE)","v":"Tayside Central & Fife"},"2019/20","Q2",9240,"ALLOA","J",0,0,0,0,0,0,0,0,0,0,46,49,25,39,13,5,0,22,43]
[{"$f":"VLOOKUP(D82,'Sheriffdom Look up'!$A$1:$E$102,5,FALSE)","v":"South Strathclyde, Dumfries & Galloway"},"2019/20","Q2",9246,"DUMFRIES","J",0,0,0,0,0,0,0,0,0,0,609,564,359,115,62,19,3,122,566]
[{"$f":"VLOOKUP(D83,'Sheriffdom Look up'!$A$1:$E$102,5,FALSE)","v":"South Strathclyde, Dumfries & Galloway"},"2019/20","Q2",9250,"STRANRAER","J",0,0,0,0,0,0,0,0,0,0,203,203,94,56,20,7,1,37,200]
[{"$f":"VLOOKUP(D84,'Sheriffdom Look up'!$A$1:$E$102,5,FALSE)","v":"Grampian Highland & Islands"},"2019/20","Q2",9251,"ABERDEEN","J",0,0,0,0,0,0,0,0,0,0,808,767,303,342,128,29,5,248,730]
[{"$f":"VLOOKUP(D85,'Sheriffdom Look up'!$A$1:$E$102,5,FALSE)","v":"Grampian Highland & Islands"},"2019/20","Q2",9252,"BANFF","J",0,0,0,0,0,0,0,0,0,0,24,13,4,19,9,4,0,24,13]
[{"$f":"VLOOKUP(D86,'Sheriffdom Look up'!$A$1:$E$102,5,FALSE)","v":"Grampian Highland & Islands"},"2019/20","Q2",9253,"PETERHEAD","J",0,0,0,0,0,0,0,0,0,0,115,110,82,67,19,4,0,60,91]
[{"$f":"VLOOKUP(D87,'Sheriffdom Look up'!$A$1:$E$102,5,FALSE)","v":"Tayside Central & Fife"},"2019/20","Q2",9256,"DUNDEE","J",0,0,0,0,0,0,0,0,0,0,259,301,271,114,59,8,0,76,290]
[{"$f":"VLOOKUP(D88,'Sheriffdom Look up'!$A$1:$E$102,5,FALSE)","v":"North Strathclyde"},"2019/20","Q2",9261,"KILMARNOCK","J",0,0,0,0,0,0,0,0,0,0,264,268,138,145,63,9,2,120,251]
[{"$f":"VLOOKUP(D89,'Sheriffdom Look up'!$A$1:$E$102,5,FALSE)","v":"Tayside Central & Fife"},"2019/20","Q2",9264,"FORFAR","J",0,0,0,0,0,0,0,0,0,0,129,143,72,69,30,5,1,33,149]
[{"$f":"VLOOKUP(D90,'Sheriffdom Look up'!$A$1:$E$102,5,FALSE)","v":"Lothian & Borders"},"2019/20","Q2",9278,"EDINBURGH","J",0,0,0,0,0,0,0,0,0,0,988,896,561,660,350,38,6,359,816]
[{"$f":"VLOOKUP(D91,'Sheriffdom Look up'!$A$1:$E$102,5,FALSE)","v":"Tayside Central & Fife"},"2019/20","Q2",9282,"FALKIRK","J",0,0,0,0,0,0,0,0,0,0,163,158,95,115,57,12,0,69,151]
[{"$f":"VLOOKUP(D92,'Sheriffdom Look up'!$A$1:$E$102,5,FALSE)","v":"Tayside Central & Fife"},"2019/20","Q2",9286,"DUNFERMLINE","J",0,0,0,0,0,0,0,0,0,0,135,164,91,64,28,4,0,30,135]
[{"$f":"VLOOKUP(D93,'Sheriffdom Look up'!$A$1:$E$102,5,FALSE)","v":"Tayside Central & Fife"},"2019/20","Q2",9287,"KIRKCALDY","J",0,0,0,0,0,0,0,0,0,0,239,236,173,133,77,17,0,107,226]
[{"$f":"VLOOKUP(D94,'Sheriffdom Look up'!$A$1:$E$102,5,FALSE)","v":"North Strathclyde"},"2019/20","Q2",9289,"CAMPBELTOWN","J",0,0,0,0,0,0,0,0,0,0,9,10,3,5,5,1,0,4,11]
[{"$f":"VLOOKUP(D95,'Sheriffdom Look up'!$A$1:$E$102,5,FALSE)","v":"North Strathclyde"},"2019/20","Q2",9290,"DUNOON","J",0,0,0,0,0,0,0,0,0,0,30,30,19,10,8,1,0,6,25]
[{"$f":"VLOOKUP(D96,'Sheriffdom Look up'!$A$1:$E$102,5,FALSE)","v":"North Strathclyde"},"2019/20","Q2",9292,"LOCHGILPHEAD","J",0,0,0,0,0,0,0,0,0,0,14,14,9,8,4,0,0,11,6]
[{"$f":"VLOOKUP(D97,'Sheriffdom Look up'!$A$1:$E$102,5,FALSE)","v":"North Strathclyde"},"2019/20","Q2",9293,"OBAN","J",0,0,0,0,0,0,0,0,0,0,12,19,9,14,7,0,0,6,21]
[{"$f":"VLOOKUP(D98,'Sheriffdom Look up'!$A$1:$E$102,5,FALSE)","v":"Glasgow & Strathkelvin"},"2019/20","Q2",9295,"GLASGOW","J",0,0,0,0,0,0,0,0,0,0,1449,1401,460,1047,603,55,9,862,1257]
[{"$f":"VLOOKUP(D99,'Sheriffdom Look up'!$A$1:$E$102,5,FALSE)","v":"North Strathclyde"},"2019/20","Q2",9340,"GREENOCK","J",0,0,0,0,0,0,0,0,0,0,86,93,57,112,44,5,1,70,70]
[{"$f":"VLOOKUP(D100,'Sheriffdom Look up'!$A$1:$E$102,5,FALSE)","v":"Grampian Highland & Islands"},"2019/20","Q2",9341,"ELGIN","J",0,0,0,0,0,0,0,0,0,0,101,132,100,86,33,7,1,77,126]
[{"$f":"VLOOKUP(D101,'Sheriffdom Look up'!$A$1:$E$102,5,FALSE)","v":"North Strathclyde"},"2019/20","Q2",9342,"PAISLEY","J",0,0,0,0,0,0,0,0,0,0,313,302,165,236,133,19,2,166,268]
[{"$f":"VLOOKUP(D102,'Sheriffdom Look up'!$A$1:$E$102,5,FALSE)","v":"Grampian Highland & Islands"},"2019/20","Q2",9345,"FORT WILLIAM","J",0,0,0,0,0,0,0,0,0,0,85,64,57,27,7,1,0,11,67]
[{"$f":"VLOOKUP(D103,'Sheriffdom Look up'!$A$1:$E$102,5,FALSE)","v":"Grampian Highland & Islands"},"2019/20","Q2",9346,"INVERNESS","J",0,0,0,0,0,0,0,0,0,0,274,294,196,231,89,14,1,111,288]
[{"$f":"VLOOKUP(D104,'Sheriffdom Look up'!$A$1:$E$102,5,FALSE)","v":"Grampian Highland & Islands"},"2019/20","Q2",9348,"TAIN","J",0,0,0,0,0,0,0,0,0,0,58,56,41,48,15,2,0,19,56]
[{"$f":"VLOOKUP(D105,'Sheriffdom Look up'!$A$1:$E$102,5,FALSE)","v":"Lothian & Borders"},"2019/20","Q2",9351,"JEDBURGH","J",0,0,0,0,0,0,0,0,0,0,38,28,25,24,6,1,0,6,34]
[{"$f":"VLOOKUP(D106,'Sheriffdom Look up'!$A$1:$E$102,5,FALSE)","v":"Lothian & Borders"},"2019/20","Q2",9353,"SELKIRK","J",0,0,0,0,0,0,0,0,0,0,40,137,53,22,7,0,0,11,121]
[{"$f":"VLOOKUP(D107,'Sheriffdom Look up'!$A$1:$E$102,5,FALSE)","v":"South Strathclyde, Dumfries & Galloway"},"2019/20","Q2",9355,"AIRDRIE","J",0,0,0,0,0,0,0,0,0,0,241,213,156,230,86,15,1,105,198]
[{"$f":"VLOOKUP(D108,'Sheriffdom Look up'!$A$1:$E$102,5,FALSE)","v":"Tayside Central & Fife"},"2019/20","Q2",9358,"PERTH","J",0,0,0,0,0,0,0,0,0,0,401,416,208,85,52,9,4,123,394]
[{"$f":"VLOOKUP(D109,'Sheriffdom Look up'!$A$1:$E$102,5,FALSE)","v":"South Strathclyde, Dumfries & Galloway"},"2019/20","Q2",9360,"AYR","J",0,0,0,0,0,0,0,0,0,0,174,144,110,93,49,11,2,55,131]
[{"$f":"VLOOKUP(D110,'Sheriffdom Look up'!$A$1:$E$102,5,FALSE)","v":"South Strathclyde, Dumfries & Galloway"},"2019/20","Q2",9366,"HAMILTON","J",0,0,0,0,0,0,0,0,0,0,421,352,251,499,220,30,16,288,355]
[{"$f":"VLOOKUP(D111,'Sheriffdom Look up'!$A$1:$E$102,5,FALSE)","v":"South Strathclyde, Dumfries & Galloway"},"2019/20","Q2",9367,"LANARK","J",0,0,0,0,0,0,0,0,0,0,107,91,34,42,25,3,0,30,69]
[{"$f":"VLOOKUP(D112,'Sheriffdom Look up'!$A$1:$E$102,5,FALSE)","v":"Tayside Central & Fife"},"2019/20","Q2",9372,"STIRLING","J",0,0,0,0,0,0,0,0,0,0,93,102,89,54,31,10,1,38,91]
[{"$f":"VLOOKUP(D113,'Sheriffdom Look up'!$A$1:$E$102,5,FALSE)","v":"North Strathclyde"},"2019/20","Q2",9376,"DUMBARTON","J",0,0,0,0,0,0,0,0,0,0,173,182,134,131,52,9,4,95,165]
[{"$f":"VLOOKUP(D114,'Sheriffdom Look up'!$A$1:$E$102,5,FALSE)","v":"Lothian & Borders"},"2019/20","Q2",9380,"LIVINGSTON","J",0,0,0,0,0,0,0,0,0,0,233,216,130,120,49,8,1,51,172]
[{"$f":"VLOOKUP(D115,'Sheriffdom Look up'!$A$1:$E$102,5,FALSE)","v":"Grampian Highland & Islands"},"2019/20","Q2",9701,"ABERDEEN","S",162,142,102,48,47,65,31,3,56,128,999,882,241,1184,520,153,31,1059,865]
[{"$f":"VLOOKUP(D116,'Sheriffdom Look up'!$A$1:$E$102,5,FALSE)","v":"South Strathclyde, Dumfries & Galloway"},"2019/20","Q2",9702,"AIRDRIE","S",89,33,56,32,6,41,11,0,21,52,620,630,171,734,423,85,3,421,578]
[{"$f":"VLOOKUP(D117,'Sheriffdom Look up'!$A$1:$E$102,5,FALSE)","v":"Tayside Central & Fife"},"2019/20","Q2",9703,"ALLOA","S",51,0,0,0,0,0,0,0,0,1,199,193,51,247,107,13,10,180,171]
[{"$f":"VLOOKUP(D118,'Sheriffdom Look up'!$A$1:$E$102,5,FALSE)","v":"South Strathclyde, Dumfries & Galloway"},"2019/20","Q2",9704,"AYR","S",64,35,27,22,10,25,7,0,8,38,501,491,143,503,205,44,7,326,421]
[{"$f":"VLOOKUP(D119,'Sheriffdom Look up'!$A$1:$E$102,5,FALSE)","v":"Grampian Highland & Islands"},"2019/20","Q2",9711,"BANFF","S",4,0,0,0,0,0,0,0,0,0,31,33,19,90,46,11,3,58,46]
[{"$f":"VLOOKUP(D120,'Sheriffdom Look up'!$A$1:$E$102,5,FALSE)","v":"North Strathclyde"},"2019/20","Q2",9716,"CAMPBELTOWN","S",3,1,1,0,0,0,0,0,1,0,39,37,5,20,20,6,1,30,27]
[{"$f":"VLOOKUP(D121,'Sheriffdom Look up'!$A$1:$E$102,5,FALSE)","v":"North Strathclyde"},"2019/20","Q2",9723,"DUMBARTON","S",42,33,36,18,7,22,11,0,9,47,400,365,115,398,233,42,18,340,321]
[{"$f":"VLOOKUP(D122,'Sheriffdom Look up'!$A$1:$E$102,5,FALSE)","v":"South Strathclyde, Dumfries & Galloway"},"2019/20","Q2",9724,"DUMFRIES","S",47,22,20,10,9,9,6,0,4,20,443,429,92,257,177,53,0,254,370]
[{"$f":"VLOOKUP(D123,'Sheriffdom Look up'!$A$1:$E$102,5,FALSE)","v":"Tayside Central & Fife"},"2019/20","Q2",9726,"DUNDEE","S",135,102,82,39,16,64,27,2,33,102,755,642,114,590,356,61,5,562,597]
[{"$f":"VLOOKUP(D124,'Sheriffdom Look up'!$A$1:$E$102,5,FALSE)","v":"Tayside Central & Fife"},"2019/20","Q2",9727,"DUNFERMLINE","S",54,31,34,26,9,18,4,1,10,37,377,358,84,383,174,29,5,274,328]
[{"$f":"VLOOKUP(D125,'Sheriffdom Look up'!$A$1:$E$102,5,FALSE)","v":"North Strathclyde"},"2019/20","Q2",9728,"DUNOON","S",2,4,3,2,0,2,1,0,0,2,83,77,13,73,47,12,2,64,67]
[{"$f":"VLOOKUP(D126,'Sheriffdom Look up'!$A$1:$E$102,5,FALSE)","v":"Lothian & Borders"},"2019/20","Q2",9741,"EDINBURGH","S",349,192,172,165,32,108,21,0,58,144,2253,2025,558,2600,1334,131,11,1790,1776]
[{"$f":"VLOOKUP(D127,'Sheriffdom Look up'!$A$1:$E$102,5,FALSE)","v":"Grampian Highland & Islands"},"2019/20","Q2",9742,"ELGIN","S",32,19,18,24,3,10,4,0,7,15,208,176,49,280,89,24,4,152,212]
[{"$f":"VLOOKUP(D128,'Sheriffdom Look up'!$A$1:$E$102,5,FALSE)","v":"Tayside Central & Fife"},"2019/20","Q2",9751,"FALKIRK","S",61,28,21,13,4,21,6,0,10,41,545,511,94,521,289,47,16,390,432]
[{"$f":"VLOOKUP(D129,'Sheriffdom Look up'!$A$1:$E$102,5,FALSE)","v":"Tayside Central & Fife"},"2019/20","Q2",9752,"FORFAR","S",44,0,0,0,0,0,0,0,0,0,309,299,50,319,168,20,2,194,318]
[{"$f":"VLOOKUP(D130,'Sheriffdom Look up'!$A$1:$E$102,5,FALSE)","v":"Grampian Highland & Islands"},"2019/20","Q2",9753,"FORT WILLIAM","S",4,0,0,0,0,0,0,0,0,1,54,49,24,91,35,7,1,62,51]
[{"$f":"VLOOKUP(D131,'Sheriffdom Look up'!$A$1:$E$102,5,FALSE)","v":"Glasgow & Strathkelvin"},"2019/20","Q2",9761,"GLASGOW","S",454,256,298,78,36,181,62,0,124,269,2677,2682,307,2683,2159,290,15,2263,2526]
[{"$f":"VLOOKUP(D132,'Sheriffdom Look up'!$A$1:$E$102,5,FALSE)","v":"North Strathclyde"},"2019/20","Q2",9762,"GREENOCK","S",35,19,16,4,6,12,7,0,4,18,259,257,48,271,199,34,18,217,214]
[{"$f":"VLOOKUP(D133,'Sheriffdom Look up'!$A$1:$E$102,5,FALSE)","v":"South Strathclyde, Dumfries & Galloway"},"2019/20","Q2",9772,"HAMILTON","S",171,101,85,40,18,45,15,0,33,101,1082,928,111,1276,643,148,19,855,941]
[{"$f":"VLOOKUP(D134,'Sheriffdom Look up'!$A$1:$E$102,5,FALSE)","v":"Grampian Highland & Islands"},"2019/20","Q2",9781,"INVERNESS","S",66,31,35,77,1,11,6,1,21,26,417,347,101,534,184,22,4,395,321]
[{"$f":"VLOOKUP(D135,'Sheriffdom Look up'!$A$1:$E$102,5,FALSE)","v":"Lothian & Borders"},"2019/20","Q2",9791,"JEDBURGH","S",14,7,7,3,3,6,2,0,2,6,132,134,17,156,63,12,1,84,125]
[{"$f":"VLOOKUP(D136,'Sheriffdom Look up'!$A$1:$E$102,5,FALSE)","v":"North Strathclyde"},"2019/20","Q2",9801,"KILMARNOCK","S",90,74,64,20,17,31,16,0,8,63,834,786,115,590,363,88,22,559,637]
[{"$f":"VLOOKUP(D137,'Sheriffdom Look up'!$A$1:$E$102,5,FALSE)","v":"Tayside Central & Fife"},"2019/20","Q2",9803,"KIRKCALDY","S",108,35,29,13,4,17,9,0,12,30,655,612,217,736,371,93,16,517,577]
[{"$f":"VLOOKUP(D138,'Sheriffdom Look up'!$A$1:$E$102,5,FALSE)","v":"Grampian Highland & Islands"},"2019/20","Q2",9805,"KIRKWALL","S",3,1,0,1,1,1,1,0,1,3,67,57,23,22,15,6,2,15,59]
[{"$f":"VLOOKUP(D139,'Sheriffdom Look up'!$A$1:$E$102,5,FALSE)","v":"South Strathclyde, Dumfries & Galloway"},"2019/20","Q2",9811,"LANARK","S",20,2,11,9,0,3,1,0,4,4,135,138,39,161,84,21,1,97,130]
[{"$f":"VLOOKUP(D140,'Sheriffdom Look up'!$A$1:$E$102,5,FALSE)","v":"Grampian Highland & Islands"},"2019/20","Q2",9812,"LERWICK","S",5,7,4,0,3,0,0,0,3,3,64,69,47,40,16,3,0,30,59]
[{"$f":"VLOOKUP(D141,'Sheriffdom Look up'!$A$1:$E$102,5,FALSE)","v":"Grampian Highland & Islands"},"2019/20","Q2",9814,"LOCHMADDY","S",0,0,0,0,0,1,1,0,0,1,7,6,4,11,3,0,0,3,13]
[{"$f":"VLOOKUP(D142,'Sheriffdom Look up'!$A$1:$E$102,5,FALSE)","v":"Lothian & Borders"},"2019/20","Q2",9815,"LIVINGSTON","S",85,36,30,32,11,12,5,1,10,49,482,455,201,578,230,24,11,298,390]
[{"$f":"VLOOKUP(D143,'Sheriffdom Look up'!$A$1:$E$102,5,FALSE)","v":"North Strathclyde"},"2019/20","Q2",9841,"OBAN","S",6,6,1,2,0,4,3,0,0,4,55,49,14,52,36,8,2,39,59]
[{"$f":"VLOOKUP(D144,'Sheriffdom Look up'!$A$1:$E$102,5,FALSE)","v":"North Strathclyde"},"2019/20","Q2",9851,"PAISLEY","S",101,39,44,35,13,35,15,0,19,47,686,645,142,816,463,81,21,584,490]
[{"$f":"VLOOKUP(D145,'Sheriffdom Look up'!$A$1:$E$102,5,FALSE)","v":"Tayside Central & Fife"},"2019/20","Q2",9853,"PERTH","S",56,23,36,17,7,21,8,0,15,30,330,325,81,444,220,68,15,383,287]
[{"$f":"VLOOKUP(D146,'Sheriffdom Look up'!$A$1:$E$102,5,FALSE)","v":"Grampian Highland & Islands"},"2019/20","Q2",9854,"PETERHEAD","S",56,0,0,0,0,0,0,0,0,0,279,235,51,160,99,22,10,209,210]
[{"$f":"VLOOKUP(D147,'Sheriffdom Look up'!$A$1:$E$102,5,FALSE)","v":"Grampian Highland & Islands"},"2019/20","Q2",9855,"PORTREE","S",5,1,1,0,0,1,0,0,0,2,22,26,11,24,18,3,1,16,26]
[{"$f":"VLOOKUP(D148,'Sheriffdom Look up'!$A$1:$E$102,5,FALSE)","v":"Lothian & Borders"},"2019/20","Q2",9871,"SELKIRK","S",20,4,4,9,3,3,2,0,0,7,176,173,28,183,101,15,3,101,171]
[{"$f":"VLOOKUP(D149,'Sheriffdom Look up'!$A$1:$E$102,5,FALSE)","v":"Tayside Central & Fife"},"2019/20","Q2",9872,"STIRLING","S",35,25,40,20,6,20,6,1,12,32,252,238,73,299,141,27,3,186,226]
[{"$f":"VLOOKUP(D150,'Sheriffdom Look up'!$A$1:$E$102,5,FALSE)","v":"Grampian Highland & Islands"},"2019/20","Q2",9874,"STORNOWAY","S",1,3,2,4,0,0,0,0,0,1,53,48,32,45,14,3,0,15,40]
[{"$f":"VLOOKUP(D151,'Sheriffdom Look up'!$A$1:$E$102,5,FALSE)","v":"South Strathclyde, Dumfries & Galloway"},"2019/20","Q2",9875,"STRANRAER","S",12,11,7,3,4,2,2,0,0,12,118,116,11,78,53,16,2,66,91]
[{"$f":"VLOOKUP(D152,'Sheriffdom Look up'!$A$1:$E$102,5,FALSE)","v":"Grampian Highland & Islands"},"2019/20","Q2",9881,"TAIN","S",15,0,0,0,0,0,0,0,0,0,106,104,24,144,65,3,2,72,92]
[{"$f":"VLOOKUP(D153,'Sheriffdom Look up'!$A$1:$E$102,5,FALSE)","v":"Grampian Highland & Islands"},"2019/20","Q2",9891,"WICK","S",5,4,2,7,2,1,1,0,3,1,89,84,16,56,24,9,0,26,84]
[{"$f":"VLOOKUP(D154,'Sheriffdom Look up'!$A$1:$E$102,5,FALSE)","v":"National JP"},"2019/20","Q3",1,"NATIONAL","J",0,0,0,0,0,0,0,0,0,0,7965,8000,4625,4356,2460,407,83,3300,7782]
[{"$f":"VLOOKUP(D155,'Sheriffdom Look up'!$A$1:$E$102,5,FALSE)","v":"National SC"},"2019/20","Q3",0,"NATIONAL","S",2492,1438,1188,720,283,749,292,14,482,1315,16138,15292,3593,17738,9986,1747,293,13832,14419]
[{"$f":"VLOOKUP(D156,'Sheriffdom Look up'!$A$1:$E$102,5,FALSE)","v":"Tayside Central & Fife"},"2019/20","Q3",9240,"ALLOA","J",0,0,0,0,0,0,0,0,0,0,50,50,32,28,19,6,1,13,56]
[{"$f":"VLOOKUP(D157,'Sheriffdom Look up'!$A$1:$E$102,5,FALSE)","v":"South Strathclyde, Dumfries & Galloway"},"2019/20","Q3",9246,"DUMFRIES","J",0,0,0,0,0,0,0,0,0,0,492,527,286,119,57,13,1,136,472]
[{"$f":"VLOOKUP(D158,'Sheriffdom Look up'!$A$1:$E$102,5,FALSE)","v":"South Strathclyde, Dumfries & Galloway"},"2019/20","Q3",9250,"STRANRAER","J",0,0,0,0,0,0,0,0,0,0,239,199,81,38,32,6,6,25,190]
[{"$f":"VLOOKUP(D159,'Sheriffdom Look up'!$A$1:$E$102,5,FALSE)","v":"Grampian Highland & Islands"},"2019/20","Q3",9251,"ABERDEEN","J",0,0,0,0,0,0,0,0,0,0,887,868,415,313,120,30,11,231,868]
[{"$f":"VLOOKUP(D160,'Sheriffdom Look up'!$A$1:$E$102,5,FALSE)","v":"Grampian Highland & Islands"},"2019/20","Q3",9252,"BANFF","J",0,0,0,0,0,0,0,0,0,0,18,29,10,21,14,4,0,21,33]
[{"$f":"VLOOKUP(D161,'Sheriffdom Look up'!$A$1:$E$102,5,FALSE)","v":"Grampian Highland & Islands"},"2019/20","Q3",9253,"PETERHEAD","J",0,0,0,0,0,0,0,0,0,0,127,95,66,71,29,7,5,52,97]
[{"$f":"VLOOKUP(D162,'Sheriffdom Look up'!$A$1:$E$102,5,FALSE)","v":"Tayside Central & Fife"},"2019/20","Q3",9256,"DUNDEE","J",0,0,0,0,0,0,0,0,0,0,407,365,283,148,46,8,0,103,280]
[{"$f":"VLOOKUP(D163,'Sheriffdom Look up'!$A$1:$E$102,5,FALSE)","v":"North Strathclyde"},"2019/20","Q3",9261,"KILMARNOCK","J",0,0,0,0,0,0,0,0,0,0,217,233,99,120,63,15,0,119,221]
[{"$f":"VLOOKUP(D164,'Sheriffdom Look up'!$A$1:$E$102,5,FALSE)","v":"Tayside Central & Fife"},"2019/20","Q3",9264,"FORFAR","J",0,0,0,0,0,0,0,0,0,0,123,141,66,47,27,7,0,19,160]
[{"$f":"VLOOKUP(D165,'Sheriffdom Look up'!$A$1:$E$102,5,FALSE)","v":"Lothian & Borders"},"2019/20","Q3",9278,"EDINBURGH","J",0,0,0,0,0,0,0,0,0,0,874,859,626,589,254,30,11,432,787]
[{"$f":"VLOOKUP(D166,'Sheriffdom Look up'!$A$1:$E$102,5,FALSE)","v":"Tayside Central & Fife"},"2019/20","Q3",9282,"FALKIRK","J",0,0,0,0,0,0,0,0,0,0,155,144,88,94,41,7,0,60,144]
[{"$f":"VLOOKUP(D167,'Sheriffdom Look up'!$A$1:$E$102,5,FALSE)","v":"Tayside Central & Fife"},"2019/20","Q3",9286,"DUNFERMLINE","J",0,0,0,0,0,0,0,0,0,0,222,180,99,65,18,3,0,45,154]
[{"$f":"VLOOKUP(D168,'Sheriffdom Look up'!$A$1:$E$102,5,FALSE)","v":"Tayside Central & Fife"},"2019/20","Q3",9287,"KIRKCALDY","J",0,0,0,0,0,0,0,0,0,0,294,260,198,121,59,13,0,123,217]
[{"$f":"VLOOKUP(D169,'Sheriffdom Look up'!$A$1:$E$102,5,FALSE)","v":"North Strathclyde"},"2019/20","Q3",9289,"CAMPBELTOWN","J",0,0,0,0,0,0,0,0,0,0,16,8,0,4,2,0,0,1,6]
[{"$f":"VLOOKUP(D170,'Sheriffdom Look up'!$A$1:$E$102,5,FALSE)","v":"North Strathclyde"},"2019/20","Q3",9290,"DUNOON","J",0,0,0,0,0,0,0,0,0,0,37,37,27,9,8,3,0,11,34]
[{"$f":"VLOOKUP(D171,'Sheriffdom Look up'!$A$1:$E$102,5,FALSE)","v":"North Strathclyde"},"2019/20","Q3",9292,"LOCHGILPHEAD","J",0,0,0,0,0,0,0,0,0,0,13,11,6,8,14,2,0,1,19]
[{"$f":"VLOOKUP(D172,'Sheriffdom Look up'!$A$1:$E$102,5,FALSE)","v":"North Strathclyde"},"2019/20","Q3",9293,"OBAN","J",0,0,0,0,0,0,0,0,0,0,19,19,7,3,5,3,0,4,18]
[{"$f":"VLOOKUP(D173,'Sheriffdom Look up'!$A$1:$E$102,5,FALSE)","v":"Glasgow & Strathkelvin"},"2019/20","Q3",9295,"GLASGOW","J",0,0,0,0,0,0,0,0,0,0,1126,1192,468,732,760,89,8,748,1281]
[{"$f":"VLOOKUP(D174,'Sheriffdom Look up'!$A$1:$E$102,5,FALSE)","v":"North Strathclyde"},"2019/20","Q3",9340,"GREENOCK","J",0,0,0,0,0,0,0,0,0,0,74,67,54,69,56,7,3,65,67]
[{"$f":"VLOOKUP(D175,'Sheriffdom Look up'!$A$1:$E$102,5,FALSE)","v":"Grampian Highland & Islands"},"2019/20","Q3",9341,"ELGIN","J",0,0,0,0,0,0,0,0,0,0,82,75,54,66,35,8,1,61,82]
[{"$f":"VLOOKUP(D176,'Sheriffdom Look up'!$A$1:$E$102,5,FALSE)","v":"North Strathclyde"},"2019/20","Q3",9342,"PAISLEY","J",0,0,0,0,0,0,0,0,0,0,278,282,204,258,143,27,12,167,269]
[{"$f":"VLOOKUP(D177,'Sheriffdom Look up'!$A$1:$E$102,5,FALSE)","v":"Grampian Highland & Islands"},"2019/20","Q3",9345,"FORT WILLIAM","J",0,0,0,0,0,0,0,0,0,0,50,69,37,20,11,2,0,12,76]
[{"$f":"VLOOKUP(D178,'Sheriffdom Look up'!$A$1:$E$102,5,FALSE)","v":"Grampian Highland & Islands"},"2019/20","Q3",9346,"INVERNESS","J",0,0,0,0,0,0,0,0,0,0,252,262,206,168,64,11,1,110,273]
[{"$f":"VLOOKUP(D179,'Sheriffdom Look up'!$A$1:$E$102,5,FALSE)","v":"Grampian Highland & Islands"},"2019/20","Q3",9348,"TAIN","J",0,0,0,0,0,0,0,0,0,0,32,49,30,40,14,1,0,35,58]
[{"$f":"VLOOKUP(D180,'Sheriffdom Look up'!$A$1:$E$102,5,FALSE)","v":"Lothian & Borders"},"2019/20","Q3",9351,"JEDBURGH","J",0,0,0,0,0,0,0,0,0,0,33,43,12,7,5,1,0,5,42]
[{"$f":"VLOOKUP(D181,'Sheriffdom Look up'!$A$1:$E$102,5,FALSE)","v":"Lothian & Borders"},"2019/20","Q3",9353,"SELKIRK","J",0,0,0,0,0,0,0,0,0,0,74,116,35,15,7,1,0,13,117]
[{"$f":"VLOOKUP(D182,'Sheriffdom Look up'!$A$1:$E$102,5,FALSE)","v":"South Strathclyde, Dumfries & Galloway"},"2019/20","Q3",9355,"AIRDRIE","J",0,0,0,0,0,0,0,0,0,0,210,209,155,167,85,20,0,106,203]
[{"$f":"VLOOKUP(D183,'Sheriffdom Look up'!$A$1:$E$102,5,FALSE)","v":"Tayside Central & Fife"},"2019/20","Q3",9358,"PERTH","J",0,0,0,0,0,0,0,0,0,0,494,476,226,120,63,17,2,113,499]
[{"$f":"VLOOKUP(D184,'Sheriffdom Look up'!$A$1:$E$102,5,FALSE)","v":"South Strathclyde, Dumfries & Galloway"},"2019/20","Q3",9360,"AYR","J",0,0,0,0,0,0,0,0,0,0,167,186,116,118,36,7,1,60,169]
[{"$f":"VLOOKUP(D185,'Sheriffdom Look up'!$A$1:$E$102,5,FALSE)","v":"South Strathclyde, Dumfries & Galloway"},"2019/20","Q3",9366,"HAMILTON","J",0,0,0,0,0,0,0,0,0,0,381,331,163,432,227,36,17,196,337]
[{"$f":"VLOOKUP(D186,'Sheriffdom Look up'!$A$1:$E$102,5,FALSE)","v":"South Strathclyde, Dumfries & Galloway"},"2019/20","Q3",9367,"LANARK","J",0,0,0,0,0,0,0,0,0,0,78,92,58,65,29,8,0,25,102]
[{"$f":"VLOOKUP(D187,'Sheriffdom Look up'!$A$1:$E$102,5,FALSE)","v":"Tayside Central & Fife"},"2019/20","Q3",9372,"STIRLING","J",0,0,0,0,0,0,0,0,0,0,102,101,85,55,30,2,3,52,87]
[{"$f":"VLOOKUP(D188,'Sheriffdom Look up'!$A$1:$E$102,5,FALSE)","v":"North Strathclyde"},"2019/20","Q3",9376,"DUMBARTON","J",0,0,0,0,0,0,0,0,0,0,153,210,151,120,53,8,0,90,171]
[{"$f":"VLOOKUP(D189,'Sheriffdom Look up'!$A$1:$E$102,5,FALSE)","v":"Lothian & Borders"},"2019/20","Q3",9380,"LIVINGSTON","J",0,0,0,0,0,0,0,0,0,0,189,215,182,106,34,5,0,46,193]
[{"$f":"VLOOKUP(D190,'Sheriffdom Look up'!$A$1:$E$102,5,FALSE)","v":"Grampian Highland & Islands"},"2019/20","Q3",9701,"ABERDEEN","S",198,108,86,56,36,61,26,4,55,104,1065,978,247,1359,577,166,44,1067,949]
[{"$f":"VLOOKUP(D191,'Sheriffdom Look up'!$A$1:$E$102,5,FALSE)","v":"South Strathclyde, Dumfries & Galloway"},"2019/20","Q3",9702,"AIRDRIE","S",77,33,42,36,5,36,8,0,18,51,612,614,138,773,426,66,10,470,508]
[{"$f":"VLOOKUP(D192,'Sheriffdom Look up'!$A$1:$E$102,5,FALSE)","v":"Tayside Central & Fife"},"2019/20","Q3",9703,"ALLOA","S",29,0,0,0,0,0,0,0,0,1,202,187,38,232,115,18,8,195,159]
[{"$f":"VLOOKUP(D193,'Sheriffdom Look up'!$A$1:$E$102,5,FALSE)","v":"South Strathclyde, Dumfries & Galloway"},"2019/20","Q3",9704,"AYR","S",65,37,45,26,5,17,3,0,14,36,584,567,117,563,240,58,0,355,497]
[{"$f":"VLOOKUP(D194,'Sheriffdom Look up'!$A$1:$E$102,5,FALSE)","v":"Grampian Highland & Islands"},"2019/20","Q3",9711,"BANFF","S",2,0,0,0,0,0,0,0,0,0,46,43,10,70,43,11,7,62,37]
[{"$f":"VLOOKUP(D195,'Sheriffdom Look up'!$A$1:$E$102,5,FALSE)","v":"North Strathclyde"},"2019/20","Q3",9716,"CAMPBELTOWN","S",1,1,1,1,0,1,1,0,0,2,31,29,9,26,26,8,2,24,35]
[{"$f":"VLOOKUP(D196,'Sheriffdom Look up'!$A$1:$E$102,5,FALSE)","v":"North Strathclyde"},"2019/20","Q3",9723,"DUMBARTON","S",47,43,30,18,9,10,6,0,6,33,411,403,118,425,260,45,10,385,340]
[{"$f":"VLOOKUP(D197,'Sheriffdom Look up'!$A$1:$E$102,5,FALSE)","v":"South Strathclyde, Dumfries & Galloway"},"2019/20","Q3",9724,"DUMFRIES","S",35,26,27,9,9,10,4,0,7,26,362,358,78,286,169,53,0,254,350]
[{"$f":"VLOOKUP(D198,'Sheriffdom Look up'!$A$1:$E$102,5,FALSE)","v":"Tayside Central & Fife"},"2019/20","Q3",9726,"DUNDEE","S",129,75,63,40,19,49,15,0,21,72,745,690,164,615,370,59,5,696,573]
[{"$f":"VLOOKUP(D199,'Sheriffdom Look up'!$A$1:$E$102,5,FALSE)","v":"Tayside Central & Fife"},"2019/20","Q3",9727,"DUNFERMLINE","S",70,48,33,11,8,12,5,1,18,32,331,308,66,411,135,23,6,282,305]
[{"$f":"VLOOKUP(D200,'Sheriffdom Look up'!$A$1:$E$102,5,FALSE)","v":"North Strathclyde"},"2019/20","Q3",9728,"DUNOON","S",2,1,1,4,0,0,0,0,1,2,61,61,22,79,58,16,0,59,73]
[{"$f":"VLOOKUP(D201,'Sheriffdom Look up'!$A$1:$E$102,5,FALSE)","v":"Lothian & Borders"},"2019/20","Q3",9741,"EDINBURGH","S",351,215,208,129,46,104,30,4,54,206,2175,1908,603,2403,1250,130,11,2052,1759]
[{"$f":"VLOOKUP(D202,'Sheriffdom Look up'!$A$1:$E$102,5,FALSE)","v":"Grampian Highland & Islands"},"2019/20","Q3",9742,"ELGIN","S",36,13,9,16,1,10,1,0,2,20,231,202,52,245,132,26,4,131,235]
[{"$f":"VLOOKUP(D203,'Sheriffdom Look up'!$A$1:$E$102,5,FALSE)","v":"Tayside Central & Fife"},"2019/20","Q3",9751,"FALKIRK","S",58,47,37,15,13,17,5,0,15,39,577,540,129,538,323,36,12,417,507]
[{"$f":"VLOOKUP(D204,'Sheriffdom Look up'!$A$1:$E$102,5,FALSE)","v":"Tayside Central & Fife"},"2019/20","Q3",9752,"FORFAR","S",39,0,0,0,0,0,0,0,0,0,246,250,40,262,149,8,1,213,226]
[{"$f":"VLOOKUP(D205,'Sheriffdom Look up'!$A$1:$E$102,5,FALSE)","v":"Grampian Highland & Islands"},"2019/20","Q3",9753,"FORT WILLIAM","S",10,0,0,0,0,0,0,0,0,0,54,50,25,60,51,11,2,42,68]
[{"$f":"VLOOKUP(D206,'Sheriffdom Look up'!$A$1:$E$102,5,FALSE)","v":"Glasgow & Strathkelvin"},"2019/20","Q3",9761,"GLASGOW","S",493,322,223,69,46,172,68,0,113,258,2451,2541,316,2714,2179,307,27,2128,2507]
[{"$f":"VLOOKUP(D207,'Sheriffdom Look up'!$A$1:$E$102,5,FALSE)","v":"North Strathclyde"},"2019/20","Q3",9762,"GREENOCK","S",41,21,17,9,3,8,4,0,7,18,229,236,60,331,176,36,6,222,230]
[{"$f":"VLOOKUP(D208,'Sheriffdom Look up'!$A$1:$E$102,5,FALSE)","v":"South Strathclyde, Dumfries & Galloway"},"2019/20","Q3",9772,"HAMILTON","S",177,111,80,32,16,62,25,0,37,90,1076,991,122,1127,684,147,21,824,948]
[{"$f":"VLOOKUP(D209,'Sheriffdom Look up'!$A$1:$E$102,5,FALSE)","v":"Grampian Highland & Islands"},"2019/20","Q3",9781,"INVERNESS","S",59,50,38,56,1,18,9,5,19,19,402,336,91,533,184,23,6,457,300]
[{"$f":"VLOOKUP(D210,'Sheriffdom Look up'!$A$1:$E$102,5,FALSE)","v":"Lothian & Borders"},"2019/20","Q3",9791,"JEDBURGH","S",22,8,5,13,1,2,2,0,3,4,127,115,17,116,70,13,6,95,94]
[{"$f":"VLOOKUP(D211,'Sheriffdom Look up'!$A$1:$E$102,5,FALSE)","v":"North Strathclyde"},"2019/20","Q3",9801,"KILMARNOCK","S",84,69,47,35,13,29,20,0,9,77,789,766,150,605,398,97,12,630,690]
[{"$f":"VLOOKUP(D212,'Sheriffdom Look up'!$A$1:$E$102,5,FALSE)","v":"Tayside Central & Fife"},"2019/20","Q3",9803,"KIRKCALDY","S",86,40,28,21,16,25,12,0,12,46,560,501,159,739,398,89,16,445,585]
[{"$f":"VLOOKUP(D213,'Sheriffdom Look up'!$A$1:$E$102,5,FALSE)","v":"Grampian Highland & Islands"},"2019/20","Q3",9805,"KIRKWALL","S",2,1,0,1,1,1,1,0,0,3,50,42,13,20,11,4,4,16,37]
[{"$f":"VLOOKUP(D214,'Sheriffdom Look up'!$A$1:$E$102,5,FALSE)","v":"South Strathclyde, Dumfries & Galloway"},"2019/20","Q3",9811,"LANARK","S",14,6,8,2,0,5,3,0,2,6,133,125,27,136,88,14,7,88,124]
[{"$f":"VLOOKUP(D215,'Sheriffdom Look up'!$A$1:$E$102,5,FALSE)","v":"Grampian Highland & Islands"},"2019/20","Q3",9812,"LERWICK","S",8,5,4,1,1,4,2,0,0,6,66,63,48,53,10,2,0,40,54]
[{"$f":"VLOOKUP(D216,'Sheriffdom Look up'!$A$1:$E$102,5,FALSE)","v":"Grampian Highland & Islands"},"2019/20","Q3",9814,"LOCHMADDY","S",0,0,0,0,0,0,0,0,0,0,2,3,1,4,2,0,0,6,3]
[{"$f":"VLOOKUP(D217,'Sheriffdom Look up'!$A$1:$E$102,5,FALSE)","v":"Lothian & Borders"},"2019/20","Q3",9815,"LIVINGSTON","S",75,30,33,19,9,15,6,0,12,31,402,386,217,578,211,25,15,375,363]
[{"$f":"VLOOKUP(D218,'Sheriffdom Look up'!$A$1:$E$102,5,FALSE)","v":"North Strathclyde"},"2019/20","Q3",9841,"OBAN","S",5,1,5,8,2,2,1,0,2,3,66,64,13,57,32,5,0,49,55]
[{"$f":"VLOOKUP(D219,'Sheriffdom Look up'!$A$1:$E$102,5,FALSE)","v":"North Strathclyde"},"2019/20","Q3",9851,"PAISLEY","S",105,35,46,39,6,35,10,0,25,44,684,677,168,853,511,89,24,658,550]
[{"$f":"VLOOKUP(D220,'Sheriffdom Look up'!$A$1:$E$102,5,FALSE)","v":"Tayside Central & Fife"},"2019/20","Q3",9853,"PERTH","S",50,34,21,9,9,18,11,0,12,32,350,325,67,483,219,61,11,373,350]
[{"$f":"VLOOKUP(D221,'Sheriffdom Look up'!$A$1:$E$102,5,FALSE)","v":"Grampian Highland & Islands"},"2019/20","Q3",9854,"PETERHEAD","S",46,0,0,0,0,0,0,0,0,0,231,196,41,231,101,28,4,173,229]
[{"$f":"VLOOKUP(D222,'Sheriffdom Look up'!$A$1:$E$102,5,FALSE)","v":"Grampian Highland & Islands"},"2019/20","Q3",9855,"PORTREE","S",3,0,1,1,0,0,0,0,0,0,47,38,18,19,11,3,0,24,30]
[{"$f":"VLOOKUP(D223,'Sheriffdom Look up'!$A$1:$E$102,5,FALSE)","v":"Lothian & Borders"},"2019/20","Q3",9871,"SELKIRK","S",15,8,9,9,3,3,2,0,0,10,131,132,33,168,80,11,2,108,136]
[{"$f":"VLOOKUP(D224,'Sheriffdom Look up'!$A$1:$E$102,5,FALSE)","v":"Tayside Central & Fife"},"2019/20","Q3",9872,"STIRLING","S",26,36,37,16,3,17,10,0,16,32,252,231,88,317,152,22,9,217,203]
[{"$f":"VLOOKUP(D225,'Sheriffdom Look up'!$A$1:$E$102,5,FALSE)","v":"Grampian Highland & Islands"},"2019/20","Q3",9874,"STORNOWAY","S",5,1,2,11,0,2,0,0,1,2,62,72,26,53,21,3,0,22,75]
[{"$f":"VLOOKUP(D226,'Sheriffdom Look up'!$A$1:$E$102,5,FALSE)","v":"South Strathclyde, Dumfries & Galloway"},"2019/20","Q3",9875,"STRANRAER","S",13,11,2,5,2,2,1,0,1,6,114,105,19,90,65,19,1,72,95]
[{"$f":"VLOOKUP(D227,'Sheriffdom Look up'!$A$1:$E$102,5,FALSE)","v":"Grampian Highland & Islands"},"2019/20","Q3",9881,"TAIN","S",6,0,0,0,0,0,0,0,0,0,73,64,18,108,41,12,0,77,62]
[{"$f":"VLOOKUP(D228,'Sheriffdom Look up'!$A$1:$E$102,5,FALSE)","v":"Grampian Highland & Islands"},"2019/20","Q3",9891,"WICK","S",8,2,0,3,0,2,1,0,0,4,108,95,25,56,18,3,0,29,78]
[{"$f":"VLOOKUP(D229,'Sheriffdom Look up'!$A$1:$E$102,5,FALSE)","v":"National JP"},"2019/20","Q4",1,"NATIONAL","J",0,0,0,0,0,0,0,0,0,0,9787,9569,4559,4638,2493,336,51,3497,8030]
[{"$f":"VLOOKUP(D230,'Sheriffdom Look up'!$A$1:$E$102,5,FALSE)","v":"National SC"},"2019/20","Q4",0,"NATIONAL","S",2280,1302,1397,771,241,766,252,15,497,1221,16647,15555,4056,19075,11138,1633,305,13971,14198]
[{"$f":"VLOOKUP(D231,'Sheriffdom Look up'!$A$1:$E$102,5,FALSE)","v":"Tayside Central & Fife"},"2019/20","Q4",9240,"ALLOA","J",0,0,0,0,0,0,0,0,0,0,62,62,37,28,12,0,0,15,52]
[{"$f":"VLOOKUP(D232,'Sheriffdom Look up'!$A$1:$E$102,5,FALSE)","v":"South Strathclyde, Dumfries & Galloway"},"2019/20","Q4",9246,"DUMFRIES","J",0,0,0,0,0,0,0,0,0,0,558,559,289,125,67,16,0,144,478]
[{"$f":"VLOOKUP(D233,'Sheriffdom Look up'!$A$1:$E$102,5,FALSE)","v":"South Strathclyde, Dumfries & Galloway"},"2019/20","Q4",9250,"STRANRAER","J",0,0,0,0,0,0,0,0,0,0,164,199,89,44,21,4,0,27,162]
[{"$f":"VLOOKUP(D234,'Sheriffdom Look up'!$A$1:$E$102,5,FALSE)","v":"Grampian Highland & Islands"},"2019/20","Q4",9251,"ABERDEEN","J",0,0,0,0,0,0,0,0,0,0,951,951,337,308,143,25,8,268,845]
[{"$f":"VLOOKUP(D235,'Sheriffdom Look up'!$A$1:$E$102,5,FALSE)","v":"Grampian Highland & Islands"},"2019/20","Q4",9252,"BANFF","J",0,0,0,0,0,0,0,0,0,0,31,31,12,17,17,3,0,15,36]
[{"$f":"VLOOKUP(D236,'Sheriffdom Look up'!$A$1:$E$102,5,FALSE)","v":"Grampian Highland & Islands"},"2019/20","Q4",9253,"PETERHEAD","J",0,0,0,0,0,0,0,0,0,0,112,104,53,88,33,7,2,42,117]
[{"$f":"VLOOKUP(D237,'Sheriffdom Look up'!$A$1:$E$102,5,FALSE)","v":"Tayside Central & Fife"},"2019/20","Q4",9256,"DUNDEE","J",0,0,0,0,0,0,0,0,0,0,308,371,326,167,59,4,0,102,310]
[{"$f":"VLOOKUP(D238,'Sheriffdom Look up'!$A$1:$E$102,5,FALSE)","v":"North Strathclyde"},"2019/20","Q4",9261,"KILMARNOCK","J",0,0,0,0,0,0,0,0,0,0,332,314,112,134,68,9,1,121,253]
[{"$f":"VLOOKUP(D239,'Sheriffdom Look up'!$A$1:$E$102,5,FALSE)","v":"Tayside Central & Fife"},"2019/20","Q4",9264,"FORFAR","J",0,0,0,0,0,0,0,0,0,0,183,220,53,34,7,1,0,40,148]
[{"$f":"VLOOKUP(D240,'Sheriffdom Look up'!$A$1:$E$102,5,FALSE)","v":"Lothian & Borders"},"2019/20","Q4",9278,"EDINBURGH","J",0,0,0,0,0,0,0,0,0,0,1115,1043,625,674,327,22,7,414,909]
[{"$f":"VLOOKUP(D241,'Sheriffdom Look up'!$A$1:$E$102,5,FALSE)","v":"Tayside Central & Fife"},"2019/20","Q4",9282,"FALKIRK","J",0,0,0,0,0,0,0,0,0,0,161,170,123,96,45,7,0,58,153]
[{"$f":"VLOOKUP(D242,'Sheriffdom Look up'!$A$1:$E$102,5,FALSE)","v":"Tayside Central & Fife"},"2019/20","Q4",9286,"DUNFERMLINE","J",0,0,0,0,0,0,0,0,0,0,179,220,136,143,44,4,0,60,160]
[{"$f":"VLOOKUP(D243,'Sheriffdom Look up'!$A$1:$E$102,5,FALSE)","v":"Tayside Central & Fife"},"2019/20","Q4",9287,"KIRKCALDY","J",0,0,0,0,0,0,0,0,0,0,309,318,166,196,78,13,0,112,261]
[{"$f":"VLOOKUP(D244,'Sheriffdom Look up'!$A$1:$E$102,5,FALSE)","v":"North Strathclyde"},"2019/20","Q4",9289,"CAMPBELTOWN","J",0,0,0,0,0,0,0,0,0,0,7,12,7,3,1,0,0,2,12]
[{"$f":"VLOOKUP(D245,'Sheriffdom Look up'!$A$1:$E$102,5,FALSE)","v":"North Strathclyde"},"2019/20","Q4",9290,"DUNOON","J",0,0,0,0,0,0,0,0,0,0,16,16,6,13,7,1,0,6,9]
[{"$f":"VLOOKUP(D246,'Sheriffdom Look up'!$A$1:$E$102,5,FALSE)","v":"North Strathclyde"},"2019/20","Q4",9292,"LOCHGILPHEAD","J",0,0,0,0,0,0,0,0,0,0,3,4,7,3,2,0,0,2,4]
[{"$f":"VLOOKUP(D247,'Sheriffdom Look up'!$A$1:$E$102,5,FALSE)","v":"North Strathclyde"},"2019/20","Q4",9293,"OBAN","J",0,0,0,0,0,0,0,0,0,0,19,16,7,8,3,0,0,5,14]
[{"$f":"VLOOKUP(D248,'Sheriffdom Look up'!$A$1:$E$102,5,FALSE)","v":"Glasgow & Strathkelvin"},"2019/20","Q4",9295,"GLASGOW","J",0,0,0,0,0,0,0,0,0,0,1979,1778,457,778,731,94,15,773,1373]
[{"$f":"VLOOKUP(D249,'Sheriffdom Look up'!$A$1:$E$102,5,FALSE)","v":"North Strathclyde"},"2019/20","Q4",9340,"GREENOCK","J",0,0,0,0,0,0,0,0,0,0,86,100,60,70,51,5,0,61,95]
[{"$f":"VLOOKUP(D250,'Sheriffdom Look up'!$A$1:$E$102,5,FALSE)","v":"Grampian Highland & Islands"},"2019/20","Q4",9341,"ELGIN","J",0,0,0,0,0,0,0,0,0,0,145,102,68,84,35,6,0,72,86]
[{"$f":"VLOOKUP(D251,'Sheriffdom Look up'!$A$1:$E$102,5,FALSE)","v":"North Strathclyde"},"2019/20","Q4",9342,"PAISLEY","J",0,0,0,0,0,0,0,0,0,0,367,349,179,208,136,18,3,179,298]
[{"$f":"VLOOKUP(D252,'Sheriffdom Look up'!$A$1:$E$102,5,FALSE)","v":"Grampian Highland & Islands"},"2019/20","Q4",9345,"FORT WILLIAM","J",0,0,0,0,0,0,0,0,0,0,77,80,24,14,9,2,1,14,64]
[{"$f":"VLOOKUP(D253,'Sheriffdom Look up'!$A$1:$E$102,5,FALSE)","v":"Grampian Highland & Islands"},"2019/20","Q4",9346,"INVERNESS","J",0,0,0,0,0,0,0,0,0,0,294,327,172,167,47,10,0,137,278]
[{"$f":"VLOOKUP(D254,'Sheriffdom Look up'!$A$1:$E$102,5,FALSE)","v":"Grampian Highland & Islands"},"2019/20","Q4",9348,"TAIN","J",0,0,0,0,0,0,0,0,0,0,68,79,42,38,18,0,0,35,59]
[{"$f":"VLOOKUP(D255,'Sheriffdom Look up'!$A$1:$E$102,5,FALSE)","v":"Lothian & Borders"},"2019/20","Q4",9351,"JEDBURGH","J",0,0,0,0,0,0,0,0,0,0,60,47,20,8,7,2,1,7,36]
[{"$f":"VLOOKUP(D256,'Sheriffdom Look up'!$A$1:$E$102,5,FALSE)","v":"Lothian & Borders"},"2019/20","Q4",9353,"SELKIRK","J",0,0,0,0,0,0,0,0,0,0,119,72,14,17,8,2,0,7,72]
[{"$f":"VLOOKUP(D257,'Sheriffdom Look up'!$A$1:$E$102,5,FALSE)","v":"South Strathclyde, Dumfries & Galloway"},"2019/20","Q4",9355,"AIRDRIE","J",0,0,0,0,0,0,0,0,0,0,267,241,130,191,93,12,2,125,170]
[{"$f":"VLOOKUP(D258,'Sheriffdom Look up'!$A$1:$E$102,5,FALSE)","v":"Tayside Central & Fife"},"2019/20","Q4",9358,"PERTH","J",0,0,0,0,0,0,0,0,0,0,536,541,170,124,66,10,2,110,482]
[{"$f":"VLOOKUP(D259,'Sheriffdom Look up'!$A$1:$E$102,5,FALSE)","v":"South Strathclyde, Dumfries & Galloway"},"2019/20","Q4",9360,"AYR","J",0,0,0,0,0,0,0,0,0,0,188,196,153,121,53,19,0,71,163]
[{"$f":"VLOOKUP(D260,'Sheriffdom Look up'!$A$1:$E$102,5,FALSE)","v":"South Strathclyde, Dumfries & Galloway"},"2019/20","Q4",9366,"HAMILTON","J",0,0,0,0,0,0,0,0,0,0,421,392,226,346,164,27,6,213,374]
[{"$f":"VLOOKUP(D261,'Sheriffdom Look up'!$A$1:$E$102,5,FALSE)","v":"South Strathclyde, Dumfries & Galloway"},"2019/20","Q4",9367,"LANARK","J",0,0,0,0,0,0,0,0,0,0,73,73,43,50,23,2,0,25,70]
[{"$f":"VLOOKUP(D262,'Sheriffdom Look up'!$A$1:$E$102,5,FALSE)","v":"Tayside Central & Fife"},"2019/20","Q4",9372,"STIRLING","J",0,0,0,0,0,0,0,0,0,0,135,130,93,83,43,7,3,57,95]
[{"$f":"VLOOKUP(D263,'Sheriffdom Look up'!$A$1:$E$102,5,FALSE)","v":"North Strathclyde"},"2019/20","Q4",9376,"DUMBARTON","J",0,0,0,0,0,0,0,0,0,0,206,225,153,140,53,3,0,118,199]
[{"$f":"VLOOKUP(D264,'Sheriffdom Look up'!$A$1:$E$102,5,FALSE)","v":"Lothian & Borders"},"2019/20","Q4",9380,"LIVINGSTON","J",0,0,0,0,0,0,0,0,0,0,256,227,170,118,22,1,0,60,193]
[{"$f":"VLOOKUP(D265,'Sheriffdom Look up'!$A$1:$E$102,5,FALSE)","v":"Grampian Highland & Islands"},"2019/20","Q4",9701,"ABERDEEN","S",162,140,119,74,29,55,22,3,68,100,1140,1011,268,1345,699,152,52,1200,924]
[{"$f":"VLOOKUP(D266,'Sheriffdom Look up'!$A$1:$E$102,5,FALSE)","v":"South Strathclyde, Dumfries & Galloway"},"2019/20","Q4",9702,"AIRDRIE","S",51,43,64,32,4,30,9,0,21,44,612,544,137,625,436,80,4,457,489]
[{"$f":"VLOOKUP(D267,'Sheriffdom Look up'!$A$1:$E$102,5,FALSE)","v":"Tayside Central & Fife"},"2019/20","Q4",9703,"ALLOA","S",25,0,0,0,0,0,0,0,0,1,234,222,64,313,155,16,16,195,216]
[{"$f":"VLOOKUP(D268,'Sheriffdom Look up'!$A$1:$E$102,5,FALSE)","v":"South Strathclyde, Dumfries & Galloway"},"2019/20","Q4",9704,"AYR","S",59,28,41,24,3,17,8,0,17,45,476,448,153,562,265,37,0,337,445]
[{"$f":"VLOOKUP(D269,'Sheriffdom Look up'!$A$1:$E$102,5,FALSE)","v":"Grampian Highland & Islands"},"2019/20","Q4",9711,"BANFF","S",2,0,0,0,0,0,0,0,0,0,42,34,14,65,48,13,6,60,40]
[{"$f":"VLOOKUP(D270,'Sheriffdom Look up'!$A$1:$E$102,5,FALSE)","v":"North Strathclyde"},"2019/20","Q4",9716,"CAMPBELTOWN","S",0,0,0,1,0,1,0,0,1,1,29,29,12,33,31,8,0,19,34]
[{"$f":"VLOOKUP(D271,'Sheriffdom Look up'!$A$1:$E$102,5,FALSE)","v":"North Strathclyde"},"2019/20","Q4",9723,"DUMBARTON","S",46,32,31,29,6,12,5,0,6,26,403,414,100,468,277,43,8,404,368]
[{"$f":"VLOOKUP(D272,'Sheriffdom Look up'!$A$1:$E$102,5,FALSE)","v":"South Strathclyde, Dumfries & Galloway"},"2019/20","Q4",9724,"DUMFRIES","S",35,29,18,5,9,14,9,0,1,24,412,418,108,274,200,48,0,271,366]
[{"$f":"VLOOKUP(D273,'Sheriffdom Look up'!$A$1:$E$102,5,FALSE)","v":"Tayside Central & Fife"},"2019/20","Q4",9726,"DUNDEE","S",123,82,67,32,29,36,16,0,38,82,717,667,282,651,344,33,3,698,607]
[{"$f":"VLOOKUP(D274,'Sheriffdom Look up'!$A$1:$E$102,5,FALSE)","v":"Tayside Central & Fife"},"2019/20","Q4",9727,"DUNFERMLINE","S",49,27,42,19,5,18,4,2,22,29,423,413,121,640,200,27,1,309,315]
[{"$f":"VLOOKUP(D275,'Sheriffdom Look up'!$A$1:$E$102,5,FALSE)","v":"North Strathclyde"},"2019/20","Q4",9728,"DUNOON","S",4,0,1,2,0,1,1,0,0,3,42,44,21,66,57,7,2,33,62]
[{"$f":"VLOOKUP(D276,'Sheriffdom Look up'!$A$1:$E$102,5,FALSE)","v":"Lothian & Borders"},"2019/20","Q4",9741,"EDINBURGH","S",325,166,180,165,24,104,23,3,55,160,2048,1811,601,2909,1612,137,18,1980,1809]
[{"$f":"VLOOKUP(D277,'Sheriffdom Look up'!$A$1:$E$102,5,FALSE)","v":"Grampian Highland & Islands"},"2019/20","Q4",9742,"ELGIN","S",41,12,14,22,5,3,1,0,0,18,265,234,47,225,124,18,1,165,187]
[{"$f":"VLOOKUP(D278,'Sheriffdom Look up'!$A$1:$E$102,5,FALSE)","v":"Tayside Central & Fife"},"2019/20","Q4",9751,"FALKIRK","S",70,43,37,10,12,22,7,0,13,40,524,555,104,636,466,53,15,360,551]
[{"$f":"VLOOKUP(D279,'Sheriffdom Look up'!$A$1:$E$102,5,FALSE)","v":"Tayside Central & Fife"},"2019/20","Q4",9752,"FORFAR","S",38,0,0,0,0,0,0,0,0,1,280,256,44,328,165,18,2,257,201]
[{"$f":"VLOOKUP(D280,'Sheriffdom Look up'!$A$1:$E$102,5,FALSE)","v":"Grampian Highland & Islands"},"2019/20","Q4",9753,"FORT WILLIAM","S",7,0,0,0,0,0,0,0,0,0,49,47,22,68,34,7,0,57,33]
[{"$f":"VLOOKUP(D281,'Sheriffdom Look up'!$A$1:$E$102,5,FALSE)","v":"Glasgow & Strathkelvin"},"2019/20","Q4",9761,"GLASGOW","S",450,317,294,79,29,171,49,0,116,205,2787,2639,354,2644,2119,264,23,2177,2300]
[{"$f":"VLOOKUP(D282,'Sheriffdom Look up'!$A$1:$E$102,5,FALSE)","v":"North Strathclyde"},"2019/20","Q4",9762,"GREENOCK","S",42,9,22,14,2,12,5,1,6,21,259,241,49,345,193,36,13,227,215]
[{"$f":"VLOOKUP(D283,'Sheriffdom Look up'!$A$1:$E$102,5,FALSE)","v":"South Strathclyde, Dumfries & Galloway"},"2019/20","Q4",9772,"HAMILTON","S",168,85,102,33,16,66,19,1,24,91,1066,893,143,1009,582,127,8,720,887]
[{"$f":"VLOOKUP(D284,'Sheriffdom Look up'!$A$1:$E$102,5,FALSE)","v":"Grampian Highland & Islands"},"2019/20","Q4",9781,"INVERNESS","S",49,46,55,64,6,18,8,5,11,38,461,441,143,517,210,27,7,558,316]
[{"$f":"VLOOKUP(D285,'Sheriffdom Look up'!$A$1:$E$102,5,FALSE)","v":"Lothian & Borders"},"2019/20","Q4",9791,"JEDBURGH","S",15,5,7,5,2,6,2,0,2,7,102,104,17,163,129,15,8,112,99]
[{"$f":"VLOOKUP(D286,'Sheriffdom Look up'!$A$1:$E$102,5,FALSE)","v":"North Strathclyde"},"2019/20","Q4",9801,"KILMARNOCK","S",97,73,58,26,17,25,12,0,11,71,846,797,161,739,473,89,7,615,738]
[{"$f":"VLOOKUP(D287,'Sheriffdom Look up'!$A$1:$E$102,5,FALSE)","v":"Tayside Central & Fife"},"2019/20","Q4",9803,"KIRKCALDY","S",76,33,36,11,16,28,13,0,14,38,720,691,239,685,389,76,10,452,541]
[{"$f":"VLOOKUP(D288,'Sheriffdom Look up'!$A$1:$E$102,5,FALSE)","v":"Grampian Highland & Islands"},"2019/20","Q4",9805,"KIRKWALL","S",1,3,2,1,1,1,1,0,0,2,40,49,15,30,15,8,1,17,50]
[{"$f":"VLOOKUP(D289,'Sheriffdom Look up'!$A$1:$E$102,5,FALSE)","v":"South Strathclyde, Dumfries & Galloway"},"2019/20","Q4",9811,"LANARK","S",28,7,13,6,0,5,1,0,2,5,140,110,30,117,72,8,5,67,130]
[{"$f":"VLOOKUP(D290,'Sheriffdom Look up'!$A$1:$E$102,5,FALSE)","v":"Grampian Highland & Islands"},"2019/20","Q4",9812,"LERWICK","S",4,4,4,1,1,0,0,0,1,5,55,47,35,41,19,2,0,22,68]
[{"$f":"VLOOKUP(D291,'Sheriffdom Look up'!$A$1:$E$102,5,FALSE)","v":"Grampian Highland & Islands"},"2019/20","Q4",9814,"LOCHMADDY","S",0,0,0,0,0,0,0,0,0,0,11,11,1,8,8,1,0,7,9]
[{"$f":"VLOOKUP(D292,'Sheriffdom Look up'!$A$1:$E$102,5,FALSE)","v":"Lothian & Borders"},"2019/20","Q4",9815,"LIVINGSTON","S",62,28,40,24,3,17,3,0,9,30,432,391,190,921,286,23,11,448,308]
[{"$f":"VLOOKUP(D293,'Sheriffdom Look up'!$A$1:$E$102,5,FALSE)","v":"North Strathclyde"},"2019/20","Q4",9841,"OBAN","S",3,3,3,0,0,2,2,0,0,3,59,67,10,79,60,9,3,49,76]
[{"$f":"VLOOKUP(D294,'Sheriffdom Look up'!$A$1:$E$102,5,FALSE)","v":"North Strathclyde"},"2019/20","Q4",9851,"PAISLEY","S",85,23,64,39,9,47,15,0,19,54,578,584,176,952,613,86,49,567,577]
[{"$f":"VLOOKUP(D295,'Sheriffdom Look up'!$A$1:$E$102,5,FALSE)","v":"Tayside Central & Fife"},"2019/20","Q4",9853,"PERTH","S",50,27,26,9,6,23,9,0,13,34,430,405,122,575,252,69,11,398,354]
[{"$f":"VLOOKUP(D296,'Sheriffdom Look up'!$A$1:$E$102,5,FALSE)","v":"Grampian Highland & Islands"},"2019/20","Q4",9854,"PETERHEAD","S",37,0,0,0,0,0,0,0,0,0,262,236,56,204,128,31,13,180,213]
[{"$f":"VLOOKUP(D297,'Sheriffdom Look up'!$A$1:$E$102,5,FALSE)","v":"Grampian Highland & Islands"},"2019/20","Q4",9855,"PORTREE","S",1,1,1,2,0,0,0,0,0,0,38,40,13,22,17,4,3,26,35]
[{"$f":"VLOOKUP(D298,'Sheriffdom Look up'!$A$1:$E$102,5,FALSE)","v":"Lothian & Borders"},"2019/20","Q4",9871,"SELKIRK","S",15,8,5,7,1,2,0,0,7,4,104,101,14,132,89,10,1,97,118]
[{"$f":"VLOOKUP(D299,'Sheriffdom Look up'!$A$1:$E$102,5,FALSE)","v":"Tayside Central & Fife"},"2019/20","Q4",9872,"STIRLING","S",30,22,41,20,2,25,4,0,17,28,216,226,95,350,176,22,1,201,216]
[{"$f":"VLOOKUP(D300,'Sheriffdom Look up'!$A$1:$E$102,5,FALSE)","v":"Grampian Highland & Islands"},"2019/20","Q4",9874,"STORNOWAY","S",3,1,0,5,0,1,1,0,0,1,65,62,32,44,25,3,2,32,42]
[{"$f":"VLOOKUP(D301,'Sheriffdom Look up'!$A$1:$E$102,5,FALSE)","v":"South Strathclyde, Dumfries & Galloway"},"2019/20","Q4",9875,"STRANRAER","S",9,3,7,5,4,4,3,0,3,7,105,102,22,101,83,19,1,87,90]
[{"$f":"VLOOKUP(D302,'Sheriffdom Look up'!$A$1:$E$102,5,FALSE)","v":"Grampian Highland & Islands"},"2019/20","Q4",9881,"TAIN","S",13,0,0,0,0,0,0,0,0,0,89,81,17,116,55,7,0,75,85]
[{"$f":"VLOOKUP(D303,'Sheriffdom Look up'!$A$1:$E$102,5,FALSE)","v":"Grampian Highland & Islands"},"2019/20","Q4",9891,"WICK","S",5,2,3,5,0,0,0,0,0,3,86,90,24,73,32,0,0,35,84]
[{"$f":"VLOOKUP(D304,'Sheriffdom Look up'!$A$1:$E$102,5,FALSE)","v":"National JP"},"2020/21","Q1",1,"NATIONAL","J",0,0,0,0,0,0,0,0,0,0,3891,2492,2830,1252,204,0,0,3732,253]
[{"$f":"VLOOKUP(D305,'Sheriffdom Look up'!$A$1:$E$102,5,FALSE)","v":"National SC"},"2020/21","Q1",0,"NATIONAL","S",2517,893,767,371,175,155,0,0,497,433,10572,7757,3826,5333,1328,38,0,17818,2319]
[{"$f":"VLOOKUP(D306,'Sheriffdom Look up'!$A$1:$E$102,5,FALSE)","v":"Tayside Central & Fife"},"2020/21","Q1",9240,"ALLOA","J",0,0,0,0,0,0,0,0,0,0,17,14,9,9,2,0,0,17,0]
[{"$f":"VLOOKUP(D307,'Sheriffdom Look up'!$A$1:$E$102,5,FALSE)","v":"South Strathclyde, Dumfries & Galloway"},"2020/21","Q1",9246,"DUMFRIES","J",0,0,0,0,0,0,0,0,0,0,225,21,67,41,8,0,0,139,12]
[{"$f":"VLOOKUP(D308,'Sheriffdom Look up'!$A$1:$E$102,5,FALSE)","v":"South Strathclyde, Dumfries & Galloway"},"2020/21","Q1",9250,"STRANRAER","J",0,0,0,0,0,0,0,0,0,0,44,0,22,4,1,0,0,28,0]
[{"$f":"VLOOKUP(D309,'Sheriffdom Look up'!$A$1:$E$102,5,FALSE)","v":"Grampian Highland & Islands"},"2020/21","Q1",9251,"ABERDEEN","J",0,0,0,0,0,0,0,0,0,0,391,393,373,173,7,0,0,285,52]
[{"$f":"VLOOKUP(D310,'Sheriffdom Look up'!$A$1:$E$102,5,FALSE)","v":"Grampian Highland & Islands"},"2020/21","Q1",9252,"BANFF","J",0,0,0,0,0,0,0,0,0,0,12,12,9,7,2,0,0,15,0]
[{"$f":"VLOOKUP(D311,'Sheriffdom Look up'!$A$1:$E$102,5,FALSE)","v":"Grampian Highland & Islands"},"2020/21","Q1",9253,"PETERHEAD","J",0,0,0,0,0,0,0,0,0,0,63,63,44,25,6,0,0,49,7]
[{"$f":"VLOOKUP(D312,'Sheriffdom Look up'!$A$1:$E$102,5,FALSE)","v":"Tayside Central & Fife"},"2020/21","Q1",9256,"DUNDEE","J",0,0,0,0,0,0,0,0,0,0,114,85,25,39,7,0,0,99,4]
[{"$f":"VLOOKUP(D313,'Sheriffdom Look up'!$A$1:$E$102,5,FALSE)","v":"North Strathclyde"},"2020/21","Q1",9261,"KILMARNOCK","J",0,0,0,0,0,0,0,0,0,0,139,119,427,92,15,0,0,159,24]
[{"$f":"VLOOKUP(D314,'Sheriffdom Look up'!$A$1:$E$102,5,FALSE)","v":"Tayside Central & Fife"},"2020/21","Q1",9264,"FORFAR","J",0,0,0,0,0,0,0,0,0,0,87,80,46,25,1,0,0,39,1]
[{"$f":"VLOOKUP(D315,'Sheriffdom Look up'!$A$1:$E$102,5,FALSE)","v":"Lothian & Borders"},"2020/21","Q1",9278,"EDINBURGH","J",0,0,0,0,0,0,0,0,0,0,465,517,155,291,48,0,0,471,10]
[{"$f":"VLOOKUP(D316,'Sheriffdom Look up'!$A$1:$E$102,5,FALSE)","v":"Tayside Central & Fife"},"2020/21","Q1",9282,"FALKIRK","J",0,0,0,0,0,0,0,0,0,0,69,93,26,43,6,0,0,77,2]
[{"$f":"VLOOKUP(D317,'Sheriffdom Look up'!$A$1:$E$102,5,FALSE)","v":"Tayside Central & Fife"},"2020/21","Q1",9286,"DUNFERMLINE","J",0,0,0,0,0,0,0,0,0,0,79,73,70,1,0,0,0,66,1]
[{"$f":"VLOOKUP(D318,'Sheriffdom Look up'!$A$1:$E$102,5,FALSE)","v":"Tayside Central & Fife"},"2020/21","Q1",9287,"KIRKCALDY","J",0,0,0,0,0,0,0,0,0,0,140,121,88,78,10,0,0,108,1]
[{"$f":"VLOOKUP(D319,'Sheriffdom Look up'!$A$1:$E$102,5,FALSE)","v":"North Strathclyde"},"2020/21","Q1",9289,"CAMPBELTOWN","J",0,0,0,0,0,0,0,0,0,0,8,7,2,0,0,0,0,1,0]
[{"$f":"VLOOKUP(D320,'Sheriffdom Look up'!$A$1:$E$102,5,FALSE)","v":"North Strathclyde"},"2020/21","Q1",9290,"DUNOON","J",0,0,0,0,0,0,0,0,0,0,14,6,16,0,0,0,0,13,0]
[{"$f":"VLOOKUP(D321,'Sheriffdom Look up'!$A$1:$E$102,5,FALSE)","v":"North Strathclyde"},"2020/21","Q1",9292,"LOCHGILPHEAD","J",0,0,0,0,0,0,0,0,0,0,3,3,4,1,0,0,0,1,1]
[{"$f":"VLOOKUP(D322,'Sheriffdom Look up'!$A$1:$E$102,5,FALSE)","v":"North Strathclyde"},"2020/21","Q1",9293,"OBAN","J",0,0,0,0,0,0,0,0,0,0,7,5,0,0,0,0,0,0,0]
[{"$f":"VLOOKUP(D323,'Sheriffdom Look up'!$A$1:$E$102,5,FALSE)","v":"Glasgow & Strathkelvin"},"2020/21","Q1",9295,"GLASGOW","J",0,0,0,0,0,0,0,0,0,0,819,13,0,4,1,0,0,807,10]
[{"$f":"VLOOKUP(D324,'Sheriffdom Look up'!$A$1:$E$102,5,FALSE)","v":"North Strathclyde"},"2020/21","Q1",9340,"GREENOCK","J",0,0,0,0,0,0,0,0,0,0,57,36,113,21,1,0,0,73,10]
[{"$f":"VLOOKUP(D325,'Sheriffdom Look up'!$A$1:$E$102,5,FALSE)","v":"Grampian Highland & Islands"},"2020/21","Q1",9341,"ELGIN","J",0,0,0,0,0,0,0,0,0,0,58,97,54,49,14,0,0,71,14]
[{"$f":"VLOOKUP(D326,'Sheriffdom Look up'!$A$1:$E$102,5,FALSE)","v":"North Strathclyde"},"2020/21","Q1",9342,"PAISLEY","J",0,0,0,0,0,0,0,0,0,0,116,31,333,51,8,0,0,180,2]
[{"$f":"VLOOKUP(D327,'Sheriffdom Look up'!$A$1:$E$102,5,FALSE)","v":"Grampian Highland & Islands"},"2020/21","Q1",9345,"FORT WILLIAM","J",0,0,0,0,0,0,0,0,0,0,28,14,10,7,1,0,0,14,0]
[{"$f":"VLOOKUP(D328,'Sheriffdom Look up'!$A$1:$E$102,5,FALSE)","v":"Grampian Highland & Islands"},"2020/21","Q1",9346,"INVERNESS","J",0,0,0,0,0,0,0,0,0,0,152,22,70,17,3,0,0,141,10]
[{"$f":"VLOOKUP(D329,'Sheriffdom Look up'!$A$1:$E$102,5,FALSE)","v":"Grampian Highland & Islands"},"2020/21","Q1",9348,"TAIN","J",0,0,0,0,0,0,0,0,0,0,38,14,30,26,4,0,0,35,0]
[{"$f":"VLOOKUP(D330,'Sheriffdom Look up'!$A$1:$E$102,5,FALSE)","v":"Lothian & Borders"},"2020/21","Q1",9351,"JEDBURGH","J",0,0,0,0,0,0,0,0,0,0,1,14,8,2,2,0,0,7,0]
[{"$f":"VLOOKUP(D331,'Sheriffdom Look up'!$A$1:$E$102,5,FALSE)","v":"Lothian & Borders"},"2020/21","Q1",9353,"SELKIRK","J",0,0,0,0,0,0,0,0,0,0,1,47,6,4,1,0,0,7,0]
[{"$f":"VLOOKUP(D332,'Sheriffdom Look up'!$A$1:$E$102,5,FALSE)","v":"South Strathclyde, Dumfries & Galloway"},"2020/21","Q1",9355,"AIRDRIE","J",0,0,0,0,0,0,0,0,0,0,44,36,103,3,12,0,0,135,0]
[{"$f":"VLOOKUP(D333,'Sheriffdom Look up'!$A$1:$E$102,5,FALSE)","v":"Tayside Central & Fife"},"2020/21","Q1",9358,"PERTH","J",0,0,0,0,0,0,0,0,0,0,301,336,107,85,17,0,0,136,53]
[{"$f":"VLOOKUP(D334,'Sheriffdom Look up'!$A$1:$E$102,5,FALSE)","v":"South Strathclyde, Dumfries & Galloway"},"2020/21","Q1",9360,"AYR","J",0,0,0,0,0,0,0,0,0,0,34,19,77,15,3,0,0,75,2]
[{"$f":"VLOOKUP(D335,'Sheriffdom Look up'!$A$1:$E$102,5,FALSE)","v":"South Strathclyde, Dumfries & Galloway"},"2020/21","Q1",9366,"HAMILTON","J",0,0,0,0,0,0,0,0,0,0,81,10,78,35,3,0,0,227,26]
[{"$f":"VLOOKUP(D336,'Sheriffdom Look up'!$A$1:$E$102,5,FALSE)","v":"South Strathclyde, Dumfries & Galloway"},"2020/21","Q1",9367,"LANARK","J",0,0,0,0,0,0,0,0,0,0,31,3,28,20,0,0,0,26,1]
[{"$f":"VLOOKUP(D337,'Sheriffdom Look up'!$A$1:$E$102,5,FALSE)","v":"Tayside Central & Fife"},"2020/21","Q1",9372,"STIRLING","J",0,0,0,0,0,0,0,0,0,0,26,11,186,38,3,0,0,55,2]
[{"$f":"VLOOKUP(D338,'Sheriffdom Look up'!$A$1:$E$102,5,FALSE)","v":"North Strathclyde"},"2020/21","Q1",9376,"DUMBARTON","J",0,0,0,0,0,0,0,0,0,0,109,78,188,24,6,0,0,114,7]
[{"$f":"VLOOKUP(D339,'Sheriffdom Look up'!$A$1:$E$102,5,FALSE)","v":"Lothian & Borders"},"2020/21","Q1",9380,"LIVINGSTON","J",0,0,0,0,0,0,0,0,0,0,118,99,56,22,12,0,0,62,1]
[{"$f":"VLOOKUP(D340,'Sheriffdom Look up'!$A$1:$E$102,5,FALSE)","v":"Grampian Highland & Islands"},"2020/21","Q1",9701,"ABERDEEN","S",235,84,72,10,25,35,0,0,68,30,813,693,446,765,159,5,0,1348,230]
[{"$f":"VLOOKUP(D341,'Sheriffdom Look up'!$A$1:$E$102,5,FALSE)","v":"South Strathclyde, Dumfries & Galloway"},"2020/21","Q1",9702,"AIRDRIE","S",56,24,14,8,2,4,0,0,21,1,276,198,110,58,6,1,0,631,50]
[{"$f":"VLOOKUP(D342,'Sheriffdom Look up'!$A$1:$E$102,5,FALSE)","v":"Tayside Central & Fife"},"2020/21","Q1",9703,"ALLOA","S",1,0,0,0,0,0,0,0,0,0,44,35,21,109,29,0,0,247,1]
[{"$f":"VLOOKUP(D343,'Sheriffdom Look up'!$A$1:$E$102,5,FALSE)","v":"South Strathclyde, Dumfries & Galloway"},"2020/21","Q1",9704,"AYR","S",8,6,8,16,2,0,0,0,17,8,126,80,105,87,5,0,0,456,6]
[{"$f":"VLOOKUP(D344,'Sheriffdom Look up'!$A$1:$E$102,5,FALSE)","v":"Grampian Highland & Islands"},"2020/21","Q1",9711,"BANFF","S",1,0,0,0,0,0,0,0,0,0,26,24,42,26,11,1,0,72,3]
[{"$f":"VLOOKUP(D345,'Sheriffdom Look up'!$A$1:$E$102,5,FALSE)","v":"North Strathclyde"},"2020/21","Q1",9716,"CAMPBELTOWN","S",2,0,0,0,0,0,0,0,1,0,11,3,12,1,1,0,0,21,1]
[{"$f":"VLOOKUP(D346,'Sheriffdom Look up'!$A$1:$E$102,5,FALSE)","v":"North Strathclyde"},"2020/21","Q1",9723,"DUMBARTON","S",33,27,19,12,10,2,0,0,6,6,279,219,343,187,46,1,0,552,37]
[{"$f":"VLOOKUP(D347,'Sheriffdom Look up'!$A$1:$E$102,5,FALSE)","v":"South Strathclyde, Dumfries & Galloway"},"2020/21","Q1",9724,"DUMFRIES","S",44,15,6,9,8,0,0,0,1,13,253,206,56,100,37,0,0,306,70]
[{"$f":"VLOOKUP(D348,'Sheriffdom Look up'!$A$1:$E$102,5,FALSE)","v":"Tayside Central & Fife"},"2020/21","Q1",9726,"DUNDEE","S",201,103,45,14,16,0,0,0,38,38,515,442,13,352,69,5,0,811,144]
[{"$f":"VLOOKUP(D349,'Sheriffdom Look up'!$A$1:$E$102,5,FALSE)","v":"Tayside Central & Fife"},"2020/21","Q1",9727,"DUNFERMLINE","S",0,0,2,1,0,0,0,0,22,2,99,121,95,1,5,0,0,371,3]
[{"$f":"VLOOKUP(D350,'Sheriffdom Look up'!$A$1:$E$102,5,FALSE)","v":"North Strathclyde"},"2020/21","Q1",9728,"DUNOON","S",2,0,0,0,0,0,0,0,0,0,25,14,41,11,0,0,0,49,0]
[{"$f":"VLOOKUP(D351,'Sheriffdom Look up'!$A$1:$E$102,5,FALSE)","v":"Lothian & Borders"},"2020/21","Q1",9741,"EDINBURGH","S",405,74,96,44,21,4,0,0,55,55,1473,1373,321,1177,398,4,0,2595,269]
[{"$f":"VLOOKUP(D352,'Sheriffdom Look up'!$A$1:$E$102,5,FALSE)","v":"Grampian Highland & Islands"},"2020/21","Q1",9742,"ELGIN","S",3,0,0,0,0,0,0,0,0,0,85,73,93,118,15,0,0,217,6]
[{"$f":"VLOOKUP(D353,'Sheriffdom Look up'!$A$1:$E$102,5,FALSE)","v":"Tayside Central & Fife"},"2020/21","Q1",9751,"FALKIRK","S",191,64,32,23,5,6,0,0,13,27,603,509,29,175,48,0,0,570,177]
[{"$f":"VLOOKUP(D354,'Sheriffdom Look up'!$A$1:$E$102,5,FALSE)","v":"Tayside Central & Fife"},"2020/21","Q1",9752,"FORFAR","S",3,0,0,0,0,0,0,0,0,0,170,73,33,116,18,0,0,301,2]
[{"$f":"VLOOKUP(D355,'Sheriffdom Look up'!$A$1:$E$102,5,FALSE)","v":"Grampian Highland & Islands"},"2020/21","Q1",9753,"FORT WILLIAM","S",1,0,0,0,0,0,0,0,0,0,22,13,14,4,2,0,0,66,0]
[{"$f":"VLOOKUP(D356,'Sheriffdom Look up'!$A$1:$E$102,5,FALSE)","v":"Glasgow & Strathkelvin"},"2020/21","Q1",9761,"GLASGOW","S",510,261,251,115,36,60,0,0,116,117,2157,964,32,142,82,14,0,2818,420]
[{"$f":"VLOOKUP(D357,'Sheriffdom Look up'!$A$1:$E$102,5,FALSE)","v":"North Strathclyde"},"2020/21","Q1",9762,"GREENOCK","S",32,24,16,10,2,6,0,0,6,4,183,129,163,112,30,1,0,332,41]
[{"$f":"VLOOKUP(D358,'Sheriffdom Look up'!$A$1:$E$102,5,FALSE)","v":"South Strathclyde, Dumfries & Galloway"},"2020/21","Q1",9772,"HAMILTON","S",316,89,85,35,25,13,0,0,24,56,802,678,225,166,25,1,0,986,327]
[{"$f":"VLOOKUP(D359,'Sheriffdom Look up'!$A$1:$E$102,5,FALSE)","v":"Grampian Highland & Islands"},"2020/21","Q1",9781,"INVERNESS","S",100,44,25,25,9,1,0,0,11,22,406,212,100,148,17,0,0,633,119]
[{"$f":"VLOOKUP(D360,'Sheriffdom Look up'!$A$1:$E$102,5,FALSE)","v":"Lothian & Borders"},"2020/21","Q1",9791,"JEDBURGH","S",2,0,0,5,0,2,0,0,2,0,49,21,0,60,7,0,0,123,0]
[{"$f":"VLOOKUP(D361,'Sheriffdom Look up'!$A$1:$E$102,5,FALSE)","v":"North Strathclyde"},"2020/21","Q1",9801,"KILMARNOCK","S",123,25,29,15,7,2,0,0,11,26,510,459,491,439,114,4,0,805,196]
[{"$f":"VLOOKUP(D362,'Sheriffdom Look up'!$A$1:$E$102,5,FALSE)","v":"Tayside Central & Fife"},"2020/21","Q1",9803,"KIRKCALDY","S",39,7,0,1,0,0,0,0,14,4,333,227,121,353,30,1,0,639,51]
[{"$f":"VLOOKUP(D363,'Sheriffdom Look up'!$A$1:$E$102,5,FALSE)","v":"Grampian Highland & Islands"},"2020/21","Q1",9805,"KIRKWALL","S",3,0,0,1,0,0,0,0,0,0,18,2,27,7,3,0,0,16,0]
[{"$f":"VLOOKUP(D364,'Sheriffdom Look up'!$A$1:$E$102,5,FALSE)","v":"South Strathclyde, Dumfries & Galloway"},"2020/21","Q1",9811,"LANARK","S",2,3,2,0,0,1,0,0,2,0,17,9,19,12,1,0,0,90,0]
[{"$f":"VLOOKUP(D365,'Sheriffdom Look up'!$A$1:$E$102,5,FALSE)","v":"Grampian Highland & Islands"},"2020/21","Q1",9812,"LERWICK","S",2,0,0,0,0,1,0,0,1,0,13,13,4,11,5,0,0,28,3]
[{"$f":"VLOOKUP(D366,'Sheriffdom Look up'!$A$1:$E$102,5,FALSE)","v":"Grampian Highland & Islands"},"2020/21","Q1",9814,"LOCHMADDY","S",0,0,0,0,0,0,0,0,0,0,4,4,3,2,0,0,0,9,0]
[{"$f":"VLOOKUP(D367,'Sheriffdom Look up'!$A$1:$E$102,5,FALSE)","v":"Lothian & Borders"},"2020/21","Q1",9815,"LIVINGSTON","S",27,0,0,0,0,0,0,0,9,0,233,221,52,7,29,0,0,538,30]
[{"$f":"VLOOKUP(D368,'Sheriffdom Look up'!$A$1:$E$102,5,FALSE)","v":"North Strathclyde"},"2020/21","Q1",9841,"OBAN","S",2,0,0,0,0,0,0,0,0,0,40,25,21,3,0,0,0,59,4]
[{"$f":"VLOOKUP(D369,'Sheriffdom Look up'!$A$1:$E$102,5,FALSE)","v":"North Strathclyde"},"2020/21","Q1",9851,"PAISLEY","S",161,41,49,14,7,12,0,0,19,21,430,337,449,193,56,0,0,786,105]
[{"$f":"VLOOKUP(D370,'Sheriffdom Look up'!$A$1:$E$102,5,FALSE)","v":"Tayside Central & Fife"},"2020/21","Q1",9853,"PERTH","S",4,0,9,11,0,4,0,0,13,1,147,101,2,107,7,0,0,457,15]
[{"$f":"VLOOKUP(D371,'Sheriffdom Look up'!$A$1:$E$102,5,FALSE)","v":"Grampian Highland & Islands"},"2020/21","Q1",9854,"PETERHEAD","S",2,0,0,0,0,0,0,0,0,0,125,106,95,73,35,0,0,193,5]
[{"$f":"VLOOKUP(D372,'Sheriffdom Look up'!$A$1:$E$102,5,FALSE)","v":"Grampian Highland & Islands"},"2020/21","Q1",9855,"PORTREE","S",0,0,0,0,0,0,0,0,0,0,21,26,28,18,4,0,0,28,0]
[{"$f":"VLOOKUP(D373,'Sheriffdom Look up'!$A$1:$E$102,5,FALSE)","v":"Lothian & Borders"},"2020/21","Q1",9871,"SELKIRK","S",2,0,6,0,0,0,0,0,7,0,47,27,0,46,0,0,0,105,0]
[{"$f":"VLOOKUP(D374,'Sheriffdom Look up'!$A$1:$E$102,5,FALSE)","v":"Tayside Central & Fife"},"2020/21","Q1",9872,"STIRLING","S",0,0,0,1,0,0,0,0,17,2,56,58,169,117,24,0,0,279,1]
[{"$f":"VLOOKUP(D375,'Sheriffdom Look up'!$A$1:$E$102,5,FALSE)","v":"Grampian Highland & Islands"},"2020/21","Q1",9874,"STORNOWAY","S",1,0,0,0,0,0,0,0,0,0,44,15,34,1,3,0,0,40,0]
[{"$f":"VLOOKUP(D376,'Sheriffdom Look up'!$A$1:$E$102,5,FALSE)","v":"South Strathclyde, Dumfries & Galloway"},"2020/21","Q1",9875,"STRANRAER","S",3,2,1,1,0,2,0,0,3,0,29,3,8,16,4,0,0,106,0]
[{"$f":"VLOOKUP(D377,'Sheriffdom Look up'!$A$1:$E$102,5,FALSE)","v":"Grampian Highland & Islands"},"2020/21","Q1",9881,"TAIN","S",0,0,0,0,0,0,0,0,0,0,31,11,9,13,3,0,0,82,0]
[{"$f":"VLOOKUP(D378,'Sheriffdom Look up'!$A$1:$E$102,5,FALSE)","v":"Grampian Highland & Islands"},"2020/21","Q1",9891,"WICK","S",0,0,0,0,0,0,0,0,0,0,57,33,0,0,0,0,0,53,3]

{"sheet":"FY lookup","index":10,"n_rows":12,"n_cols":9,"rows_kept":12,"cut":false,"hidden":true,"merged":[[0,8,7,12]]}
["2013-04-01","2014-03-01","2013/14",null,null,4,"Q1",null,"This data is only for The Scottish Courts and Tribunals Service Internal use. Please go to the index tab and navigate as required."]
["2014-04-01","2015-03-01","2014/15",null,null,5,"Q1"]
["2015-04-01","2016-03-01","2015/16",null,null,6,"Q1"]
["2016-04-01","2017-03-01","2016/17",null,null,7,"Q2"]
["2017-04-01","2018-03-01","2017/18",null,null,8,"Q2"]
[null,null,null,null,null,9,"Q2"]
[null,null,null,null,null,10,"Q3"]
[null,null,null,null,null,11,"Q3"]
[null,null,null,null,null,12,"Q3"]
[null,null,null,null,null,1,"Q4"]
[null,null,null,null,null,2,"Q4"]
[null,null,null,null,null,3,"Q4"]

{"sheet":"Sheriff Court lookup","index":11,"n_rows":58,"n_cols":8,"rows_kept":58,"cut":false,"hidden":true,"merged":[[0,10,3,13],[1,3,7,5]]}
[null,"Court Name","Court Code",null,null,null,"Court Name","Court Code"]
[null,"National",0,"This data is only for The Scottish Courts and Tribunals Service Internal use. Please go to the index tab and navigate as required.",null,null,"National",1]
[null,"Glasgow & Strathkelvin",null,null,null,null,"Glasgow & Strathkelvin"]
[null,"Grampian, Highland & Islands",null,null,null,null,"Grampian, Highland & Islands"]
[null,"Lothian & Borders",null,null,null,null,"Lothian & Borders"]
[null,"North Strathclyde",null,null,null,null,"North Strathclyde"]
[null,"South Strathclyde, Dumfries & Galloway",null,null,null,null,"South Strathclyde, Dumfries & Galloway"]
[null,"Tayside, Central & Fife",null,null,null,null,"Tayside, Central & Fife"]
[null,"Aberdeen",9701,null,null,null,"Aberdeen",9251]
[null,"Airdrie",9702,null,null,null,"Airdrie",9355]
[null,"Alloa",9703,null,null,null,"Alloa",9240]
[null,"Ayr",9704,null,null,null,"Annan",9245]
[null,"Arbroath",9705,null,null,null,"Arbroath",9263]
[null,"Banff",9711,null,null,null,"Ayr",9360]
[null,"Campbeltown",9716,null,null,null,"Banff",9252]
[null,"Cupar",9717,null,null,null,"Campbeltown",9289]
[null,"Dingwall",9721,null,null,null,"Cumbernauld",9356]
[null,"Dornoch",9722,null,null,null,"Cupar",9285]
[null,"Dumbarton",9723,null,null,null,"Dingwall",9343]
[null,"Dumfries",9724,null,null,null,"Dornoch",9344]
[null,"Dundee",9726,null,null,null,"Dumbarton",9376]
[null,"Dunfermline",9727,null,null,null,"Dumfries",9246]
[null,"Dunoon",9728,null,null,null,"Dundee",9256]
[null,"Duns",9729,null,null,null,"Dunfermline",9286]
[null,"Edinburgh",9741,null,null,null,"Dunoon",9290]
[null,"Elgin",9742,null,null,null,"Duns",9350]
[null,"Falkirk",9751,null,null,null,"Edinburgh",9278]
[null,"Forfar",9752,null,null,null,"Elgin",9341]
[null,"Fort William",9753,null,null,null,"Falkirk",9282]
[null,"Glasgow",9761,null,null,null,"Forfar",9264]
[null,"Greenock",9762,null,null,null,"Fort William",9345]
[null,"Haddington",9771,null,null,null,"Glasgow",9295]
[null,"Hamilton",9772,null,null,null,"Greenock",9340]
[null,"Inverness",9781,null,null,null,"Haddington",9270]
[null,"Jedburgh",9791,null,null,null,"Hamilton",9366]
[null,"Kilmarnock",9801,null,null,null,"Inverness",9346]
[null,"Kirkcaldy",9803,null,null,null,"Irvine",9354]
[null,"Kirkcudbright",9804,null,null,null,"Jedburgh",9351]
[null,"Kirkwall",9805,null,null,null,"Kilmarnock",9261]
[null,"Lanark",9811,null,null,null,"Kirkcaldy",9287]
[null,"Lerwick",9812,null,null,null,"Kirkcudbright",9247]
[null,"Linlithgow",9813,null,null,null,"Lanark",9367]
[null,"Lochmaddy",9814,null,null,null,"Livingston",9380]
[null,"Livingston",9815,null,null,null,"Lochgilphead",9292]
[null,"Oban",9841,null,null,null,"Motherwell",9357]
[null,"Paisley",9851,null,null,null,"Oban",9293]
[null,"Peebles",9852,null,null,null,"Paisley",9342]
[null,"Perth",9853,null,null,null,"Peebles",9352]
[null,"Peterhead",9854,null,null,null,"Perth",9358]
[null,"Portree",9855,null,null,null,"Peterhead",9253]
[null,"Rothesay",9861,null,null,null,"Portree",9347]
[null,"Selkirk",9871,null,null,null,"Selkirk",9353]
[null,"Stirling",9872,null,null,null,"Stirling",9372]
[null,"Stonehaven",9873,null,null,null,"Stonehaven",9254]
[null,"Stornoway",9874,null,null,null,"Stornoway",9384]
[null,"Stranraer",9875,null,null,null,"Stranraer",9250]
[null,"Tain",9881,null,null,null,"Tain",9348]
[null,"Wick",9891,null,null,null,"Wick",9349]

{"sheet":"Internal analytics","index":12,"n_rows":50,"n_cols":40,"rows_kept":50,"cut":false,"hidden":true,"merged":[[0,23,0,34],[49,1,57,2],[0,7,0,8],[3,1,3,2],[48,1,48,11],[4,1,12,1],[14,1,22,1],[24,1,34,1],[36,1,46,1]]}
[null,null,null,null,null,null,null,"Back to Index",null,null,null,null,null,null,null,null,null,null,null,null,null,null,null,"No longer in use - do not update"]
[null,null,null,null,null,{"$f":"MONTH(F4)","v":4},{"$f":"MONTH(G4)","v":5},{"$f":"MONTH(H4)","v":6},{"$f":"MONTH(I4)","v":7},{"$f":"MONTH(J4)","v":8},{"$f":"MONTH(K4)","v":9},{"$f":"MONTH(L4)","v":10},{"$f":"MONTH(M4)","v":11},{"$f":"MONTH(N4)","v":12},{"$f":"MONTH(O4)","v":1},{"$f":"MONTH(P4)","v":2},{"$f":"MONTH(Q4)","v":3},{"$f":"MONTH(R4)","v":4},{"$f":"MONTH(S4)","v":5},{"$f":"MONTH(T4)","v":6},{"$f":"MONTH(U4)","v":7},{"$f":"MONTH(V4)","v":8},{"$f":"MONTH(W4)","v":9},{"$f":"MONTH(X4)","v":10},{"$f":"MONTH(Y4)","v":11},{"$f":"MONTH(Z4)","v":12},{"$f":"MONTH(AA4)","v":1},{"$f":"MONTH(AB4)","v":2},{"$f":"MONTH(AC4)","v":3},{"$f":"MONTH(AD4)","v":4},5,{"$f":"MONTH(AF4)","v":6},7,{"$f":"MONTH(AH4)","v":8}]
[null,null,null,null,null,{"$f":"YEAR(F4)","v":2020},{"$f":"YEAR(G4)","v":2020},{"$f":"YEAR(H4)","v":2020},{"$f":"YEAR(I4)","v":2020},{"$f":"YEAR(J4)","v":2020},{"$f":"YEAR(K4)","v":2020},{"$f":"YEAR(L4)","v":2020},{"$f":"YEAR(M4)","v":2020},{"$f":"YEAR(N4)","v":2020},{"$f":"YEAR(O4)","v":2021},{"$f":"YEAR(P4)","v":2021},{"$f":"YEAR(Q4)","v":2021},{"$f":"YEAR(R4)","v":2021},{"$f":"YEAR(S4)","v":2021},{"$f":"YEAR(T4)","v":2021},{"$f":"YEAR(U4)","v":2021},{"$f":"YEAR(V4)","v":2021},{"$f":"YEAR(W4)","v":2021},{"$f":"YEAR(X4)","v":2021},{"$f":"YEAR(Y4)","v":2021},{"$f":"YEAR(Z4)","v":2021},{"$f":"YEAR(AA4)","v":2022},{"$f":"YEAR(AB4)","v":2022},{"$f":"YEAR(AC4)","v":2022},{"$f":"YEAR(AD4)","v":2022},2022,2022,2022,2022,null,null,null,"Pandemic",null,"Pre-Pandemic"]
[null,"Monitoring criminal business trends during the Coronavirus pandemic",null,null,null,"2020-04-01","2020-05-01","2020-06-01","2020-07-01","2020-08-01","2020-09-01","2020-10-01","2020-11-01","2020-12-01","2021-01-01","2021-02-01","2021-03-01","2021-04-01","2021-05-01","2021-06-01","2021-07-01","2021-08-01","2021-09-01","2021-10-01","2021-11-01","2021-12-01","2022-01-01","2022-02-01","2022-03-01","2022-04-01","2022-05-01","2022-06-01","2022-07-01","2022-08-01","2022/23","2022/23 monthly average",null,"2020/22 monthly average ",null,"2019/20  monthly average"]
[null,"High Court ","Indictments Registered",{"$f":"SUMIFS(#REF!,#REF!,#REF!,#REF!,\"NATIONAL\")","v":{"$error":"#REF!"}},null,77,85,69,63,46,68,60,32,48,65,64,90,55,43,57,66,37,57,69,54,69,68,90,80,77,70,77,72,82,712,79.111111111111114,null,52.606060606060609,null,85.333333333333329]
[null,null,"Trials Called (TC)",{"$f":"SUMIFS(#REF!,#REF!,#REF!,#REF!,\"NATIONAL\")","v":{"$error":"#REF!"}},null,0,0,0,4,14,26,42,58,47,56,67,66,46,60,67,58,74,64,65,81,38,62,64,73,73,87,83,64,82,688,76.444444444444443,null,41.666666666666664,null,67.666666666666671]
[null,null,"Evidence Led Trials (ELT)",{"$f":"SUMIFS(#REF!,#REF!,#REF!,#REF!,\"NATIONAL\")","v":{"$error":"#REF!"}},null,0,0,0,4,14,18,28,49,29,43,42,51,34,43,47,48,55,47,54,63,30,47,54,55,50,56,53,42,56,441,49,null,30.727272727272727,null,41.5]
[null,null,"Conversion rate TC to ELT",null,null,"n/a","n/a","n/a",1,1,0.69230769230769229,0.66666666666666663,0.84482758620689657,0.61702127659574468,0.7678571428571429,0.62686567164179108,0.77272727272727271,0.73913043478260865,0.71666666666666667,0.70149253731343286,0.82758620689655171,0.7432432432432432,0.734375,0.83076923076923082,0.77777777777777779,0.78947368421052633,0.75806451612903225,0.84375,0.75342465753424659,0.68493150684931503,0.64367816091954022,0.63855421686746983,0.65625,0.68292682926829273,0.64098837209302328,0.64098837209302328,null,0.73745454545454547,null,0.61330049261083741]
[null,null,"All cases concluded",{"$f":"SUMIFS(#REF!,#REF!,\"NATIONAL\",#REF!,#REF!)","v":{"$error":"#REF!"}},null,7,9,14,32,35,20,39,54,54,55,72,64,53,58,62,58,76,62,70,82,56,45,57,77,66,73,74,66,62,605,67.222222222222229,null,43.151515151515149,null,67.166666666666671]
[null,null,"Trial Indictments concluded",null,null,0,0,0,4,11,15,25,44,41,35,47,44,36,30,47,50,53,47,57,53,46,34,50,64,48,55,52,43,45,155,17.222222222222221,null,29.939393939393938,null,42.083333333333336]
[null,null,"Ratio of Registered to Concluded",{"$f":"SUMIFS(#REF!,#REF!,#REF!,#REF!,\"NATIONAL\",#REF!,\"3\")","v":{"$error":"#REF!"}},null,9.0909090909090912E-2,0.10588235294117647,0.20289855072463769,0.50793650793650791,0.76086956521739135,0.29411764705882354,0.65,1.6875,1.125,0.84615384615384615,1.125,0.71111111111111114,0.96363636363636362,1.3488372093023255,1.0877192982456141,0.87878787878787878,2.0540540540540539,1.0877192982456141,1.0144927536231885,1.5185185185185186,0.81159420289855078,0.66176470588235292,0.6333333333333333,0.96250000000000002,0.8571428571428571,1.0428571428571429,0.96103896103896103,0.91666666666666663,0.75609756097560976,0.8497191011235955,0.8497191011235955,null,0.82027649769585242,null,0.78710937500000011]
[null,null,"Ratio of Trials concluded to All concluded",null,null,0,0,0,0.125,0.31428571428571428,0.75,0.64102564102564108,0.81481481481481477,0.7592592592592593,0.63636363636363635,0.65277777777777779,0.6875,0.67924528301886788,0.51724137931034486,0.75806451612903225,0.86206896551724133,0.69736842105263153,0.75806451612903225,0.81428571428571428,0.64634146341463417,0.8214285714285714,0.75555555555555554,0.8771929824561403,0.83116883116883122,0.72727272727272729,0.75342465753424659,0.70270270270270274,0.65151515151515149,0.72580645161290325,0.256198347107438,0.256198347107438,null,0.6938202247191011,null,0.62655086848635233]
[null,null,"Scheduled Trials as at the end of the period",null,null,390,390,390,386,375,360,335,291,250,215,247,267,292,304,313,325,432,385,444,476,516,534,535,560,609,613,613,637,636,698,611.66666666666663,null,328.69696969696969,null,390]
[]
[null,"Sheriff Court - Solemn business ","Indictments Registered",{"$f":"SUMIFS(#REF!,#REF!,#REF!,#REF!,\"NATIONAL\")","v":{"$error":"#REF!"}},null,219,319,355,467,496,494,492,414,428,379,378,410,441,532,471,520,447,481,479,541,450,425,525,447,421,535,439,547,505,4322,480.22222222222223,null,363.78787878787881,null,454.33333333333331]
[null,null,"Trials Called",{"$f":"SUMIFS(#REF!,#REF!,#REF!,#REF!,\"NATIONAL\")","v":{"$error":"#REF!"}},null,91,33,31,37,146,119,73,147,78,161,285,388,362,368,383,340,392,396,393,273,263,368,433,488,425,487,458,426,537,4332,481.33333333333331,null,224.78787878787878,null,261.83333333333331]
[null,null,"Evidence Led Trials",{"$f":"SUMIFS(#REF!,#REF!,#REF!,#REF!,\"NATIONAL\")","v":{"$error":"#REF!"}},null,0,0,0,0,0,0,0,0,11,30,56,100,84,82,88,76,83,95,70,48,52,56,78,95,75,94,73,70,93,759,84.333333333333329,null,40.787878787878789,null,94.5]
[null,null,"Conversion rate TC to ELT",null,null,0,0,0,0,0,0,0,0,0.14102564102564102,0.18633540372670807,0.19649122807017544,0.25773195876288657,0.23204419889502761,0.22282608695652173,0.2297650130548303,0.22352941176470589,0.21173469387755103,0.23989898989898989,0.17811704834605599,0.17582417582417584,0.19771863117870722,0.15217391304347827,0.18013856812933027,0.19467213114754098,0.17647058823529413,0.19301848049281314,0.15938864628820962,0.16431924882629109,0.17318435754189945,0.17520775623268697,0.17520775623268697,null,0.1814505257481801,null,0.36091661362189692]
[null,null,"All cases concluded",{"$f":"SUMIFS(#REF!,#REF!,\"NATIONAL\",#REF!,#REF!)","v":{"$error":"#REF!"}},null,140,127,166,174,284,358,322,276,300,317,354,468,463,442,459,453,451,439,403,414,363,357,427,461,475,458,488,418,524,4239,471,null,298.15151515151513,null,429.58333333333331]
[null,null,"Trial Indictments concluded",null,null,29,12,8,7,16,13,20,24,24,72,164,212,203,194,217,197,214,231,202,179,113,206,254,271,238,260,231,219,313,2365,262.77777777777777,null,115.48484848484848,null,196.08333333333334]
[null,null,"Ratio of Registered to Concluded",{"$f":"SUMIFS(#REF!,#REF!,#REF!,#REF!,\"NATIONAL\",#REF!,\"3\")","v":{"$error":"#REF!"}},null,0.63926940639269403,0.39811912225705332,0.46760563380281689,0.37259100642398285,0.57258064516129037,0.7246963562753036,0.65447154471544711,0.66666666666666663,0.7009345794392523,0.83641160949868076,0.93650793650793651,1.1414634146341462,1.0498866213151927,0.83082706766917291,0.97452229299363058,0.87115384615384617,1.0089485458612975,0.91268191268191268,0.84133611691022969,0.76524953789279115,0.80666666666666664,0.84,0.81333333333333335,1.0313199105145414,1.1282660332541568,0.85607476635514024,1.1116173120728929,0.76416819012797077,1.0376237623762377,0.98079592781119851,0.98079592781119851,null,0.81957517700957927,null,0.94552457813646373]
[null,null,"Ratio of Trials concluded to All concluded",null,null,0.20714285714285716,9.4488188976377951E-2,4.8192771084337352E-2,4.0229885057471264E-2,5.6338028169014086E-2,3.6312849162011177E-2,6.2111801242236024E-2,8.6956521739130432E-2,0.08,0.22712933753943218,0.4632768361581921,0.45299145299145299,0.43844492440604754,0.43891402714932126,0.47276688453159044,0.43487858719646799,0.4745011086474501,0.5261958997722096,0.50124069478908184,0.43236714975845408,0.31129476584022037,0.57703081232492992,0.59484777517564402,0.5878524945770065,0.50105263157894742,0.56768558951965065,0.47336065573770492,0.52392344497607657,0.59732824427480913,0.55791460250058977,0.55791460250058977,null,0.38733611139343432,null,0.45645004849660525]
[null,null,"Scheduled Trials as at the end of the period",null,null,497,497,497,497,553,613,648,738,939,1091,1211,1329,1398,1479,1595,1684,1781,1842,1923,2053,2170,2212,2196,2274,2267,2307,2325,2356,2340,2438,2299.6666666666665,null,1170.1818181818182,null,497]
[]
[null,"Sheriff Court - Summary business","Complaints Registered",{"$f":"SUMIFS(#REF!,#REF!,#REF!,#REF!,\"NATIONAL\")","v":{"$error":"#REF!"}},null,3016,3247,4309,6205,6037,5855,4634,4383,3956,3790,3678,5000,5017,4603,4544,4440,4718,4453,4510,4770,4860,4614,4007,4970,4423,4858,5048,4482,4963,41832,4648,null,3755.909090909091,null,5457.5]
[null,null,"Trials Called",{"$f":"SUMIFS(#REF!,#REF!,#REF!,#REF!,\"NATIONAL\")","v":{"$error":"#REF!"}},null,802,372,154,291,2343,3107,3207,3443,3090,3805,737,2371,2657,3171,3887,4169,4499,5443,4266,3428,4703,4537,5093,6599,5094,5768,5308,4758,5724,46658,5184.2222222222226,null,2798.3030303030305,null,3394.0833333333335]
[null,null,"Evidence Led Trials",{"$f":"SUMIFS(#REF!,#REF!,#REF!,#REF!,\"NATIONAL\")","v":{"$error":"#REF!"}},null,5,9,24,79,283,440,479,491,399,176,86,250,352,433,471,408,459,551,439,385,422,427,552,604,505,589,495,431,571,4623,513.66666666666663,null,297.36363636363637,null,578.83333333333337]
[null,null,"Conversion rate TC to ELT",null,null,6.2344139650872821E-3,2.4193548387096774E-2,0.15584415584415584,0.27147766323024053,0.12078531796841656,0.14161570646926294,0.1493607733083879,0.14260819053151322,0.129126213592233,4.6254927726675429E-2,0.11668928086838534,0.10544074230282581,0.13248024087316523,0.13654998423210343,0.12117314124003087,9.7865195490525303E-2,0.10202267170482329,0.10123093882050339,0.10290670417252695,0.11231038506417736,8.9729959600255163E-2,9.4115054000440818E-2,0.10838405654820342,9.1529019548416427E-2,9.9136238712210445E-2,0.10211511789181692,9.3255463451394127E-2,9.0584279108869278E-2,9.9755415793151642E-2,9.9082686784688581E-2,9.9082686784688567E-2,null,0.10626570215715152,null,0.17054187434015075]
[null,null,"All cases concluded",{"$f":"SUMIFS(#REF!,#REF!,\"NATIONAL\",#REF!,#REF!)","v":{"$error":"#REF!"}},null,429,744,1146,2227,4084,4759,4395,4244,3944,2071,1665,2735,3466,4181,4547,4446,4654,5186,4099,4162,4410,4126,4995,5929,4987,5865,5272,4989,5695,46648,5183.1111111111113,null,3114.181818181818,null,4771.333333333333]
[null,null,"Trial Complaints concluded",null,null,33,34,62,204,1199,1657,1742,1934,1611,602,177,677,1212,1656,1863,1935,2154,2747,2170,1764,2316,1828,2741,3545,2828,3357,3116,2776,3270,26239,2915.4444444444443,null,1368.6060606060605,null,2091.75]
[null,null,"Ratio of Registered to Concluded",{"$f":"SUMIFS(#REF!,#REF!,#REF!,#REF!,\"NATIONAL\",#REF!,\"3\")","v":{"$error":"#REF!"}},null,0.14224137931034483,0.22913458577148138,0.2659549779531214,0.35890410958904112,0.67649494782176578,0.8128095644748079,0.94842468709538197,0.96828656171571981,0.99696663296258847,0.54643799472295518,0.45269168026101142,0.54700000000000004,0.69085110623878809,0.90832066043884419,1.0006602112676057,1.0013513513513514,0.98643493005510807,1.1646081293509993,0.90886917960088687,0.87253668763102721,0.90740740740740744,0.89423493714781099,1.2465685051160469,1.1929577464788732,1.1275152611349764,1.2072869493618774,1.0443740095087164,1.1131191432396252,1.14749143663107,1.1151271753681393,1.1151271753681393,null,0.82914195812658831,null,0.87427088105054196]
[null,null,"Ratio of Trials concluded to All concluded",null,null,7.6923076923076927E-2,4.5698924731182797E-2,5.4101221640488653E-2,9.1603053435114504E-2,0.29358472086190007,0.34818239125866779,0.39635949943117177,0.45570216776625827,0.40846855983772817,0.29068083051665861,0.1063063063063063,0.24753199268738574,0.34968263127524524,0.39607749342262616,0.40972069496371233,0.43522267206477733,0.46282767511817791,0.52969533359043575,0.52939741400341545,0.42383469485824121,0.52517006802721089,0.44304411051866216,0.54874874874874879,0.59790858492157195,0.56707439342289956,0.57237851662404093,0.59104704097116845,0.55642413309280414,0.57418788410886745,0.5624892814268565,0.5624892814268565,null,0.43947532305776116,null,0.43839946905127852]
[null,null,"Intermediate diets concluded",null,null,71,62,138,368,1018,1055,948,739,854,442,603,791,835,884,1005,946,1050,1054,585,984,754,912,906,943,752,908,846,814,918,7479,831,null,619.78787878787875,null,927.91666666666663]
[null,null,"After Warrant Guilty Pleas",null,null,130,103,197,245,343,466,572,721,500,458,400,459,408,411,468,518,503,502,603,507,526,535,501,558,619,628,660,678,737,5846,649.55555555555554,null,380.030303030303,null,871.16666666666663]
[null,null,"Scheduled Trials as at the end of the period",null,null,13967,15854,17818,20929,22932,25146,26370,27372,27723,28548,29324,30645,31799,32778,33598,33602,33369,32433,32448,33015,32394,32759,31904,30520,29793,28500,27525,26802,25595,22235,28606,null,23123.18181818182,null,13971]
[]
[null,"Justice of the Peace Court ","Complaints Registered",{"$f":"SUMIFS(#REF!,#REF!,#REF!,#REF!,\"NATIONAL\")","v":{"$error":"#REF!"}},null,1994,910,987,1823,1064,916,1717,1221,1426,1469,1345,2060,1992,1731,2064,1717,2012,2133,2108,2034,1856,1787,1611,2512,1893,2223,2479,1768,2114,16681,1853.4444444444443,null,1426.7878787878788,null,2798.5]
[null,null,"Trials Called",{"$f":"SUMIFS(#REF!,#REF!,#REF!,#REF!,\"NATIONAL\")","v":{"$error":"#REF!"}},null,126,71,7,23,308,698,658,738,653,860,111,276,102,50,240,495,952,875,725,638,878,681,882,1116,964,1089,971,886,1114,9098,1010.8888888888889,null,460.21212121212119,null,838.41666666666663]
[null,null,"Evidence Led Trials",{"$f":"SUMIFS(#REF!,#REF!,#REF!,#REF!,\"NATIONAL\")","v":{"$error":"#REF!"}},null,0,0,0,1,23,68,68,87,73,27,2,0,0,0,16,51,67,82,63,45,45,6,70,73,61,91,75,77,71,740,82.222222222222229,null,33.151515151515149,null,128.58333333333334]
[null,null,"Conversion rate TC to ELT",null,null,0,0,0,4.3478260869565216E-2,7.4675324675324672E-2,9.7421203438395415E-2,0.10334346504559271,0.11788617886178862,0.11179173047473201,3.1395348837209305E-2,1.8018018018018018E-2,0,0,0,6.6666666666666666E-2,0.10303030303030303,7.0378151260504201E-2,9.3714285714285708E-2,8.6896551724137933E-2,7.0532915360501561E-2,5.125284738041002E-2,8.8105726872246704E-3,7.9365079365079361E-2,6.5412186379928322E-2,6.3278008298755184E-2,8.356290174471992E-2,7.7239958805355308E-2,8.6907449209932278E-2,6.3734290843806107E-2,8.1336557485161567E-2,8.1336557485161581E-2,null,7.2035293342990719E-2,null,0.15336447669217773]
[null,null,"All cases concluded",{"$f":"SUMIFS(#REF!,#REF!,\"NATIONAL\",#REF!,#REF!)","v":{"$error":"#REF!"}},null,10,50,193,459,1389,1822,1651,1683,1624,627,135,332,206,315,2017,3032,2797,2498,2022,1921,1781,1513,1741,2215,2093,2356,2304,2143,2169,18517,2057.4444444444443,null,1175.3333333333333,null,2557.1666666666665]
[null,null,"Trial complaints concluded",null,null,1,3,3,11,131,363,349,407,346,93,6,2,1,0,76,279,493,495,401,360,409,174,478,624,529,641,566,545,651,5210,578.88888888888891,null,219.42424242424244,null,519.5]
[null,null,"Ratio of Registered to Concluded",{"$f":"SUMIFS(#REF!,#REF!,#REF!,#REF!,\"NATIONAL\",#REF!,\"3\")","v":{"$error":"#REF!"}},null,5.0150451354062184E-3,5.4945054945054944E-2,0.1955420466058764,0.25178277564454199,1.3054511278195489,1.9890829694323144,0.96156086196854984,1.3783783783783783,1.1388499298737729,0.42682096664397551,0.10037174721189591,0.16116504854368932,0.10341365461847389,0.18197573656845753,0.9772286821705426,1.7658707047175306,1.3901590457256461,1.1711204875761838,0.95920303605313095,0.94444444444444442,0.95959051724137934,0.84667039731393401,1.0806952203600249,0.88176751592356684,1.1056524035921818,1.0598290598290598,0.92940701895925781,1.21210407239819,1.0260170293282875,1.1100653438043282,1.1100653438043282,null,0.82376178744371753,null,0.91376332559109041]
[null,null,"Ratio of Trials concluded to All concluded",null,null,0.1,0.06,1.5544041450777202E-2,2.3965141612200435E-2,9.4312455003599707E-2,0.19923161361141603,0.2113870381586917,0.24183006535947713,0.21305418719211822,0.14832535885167464,4.4444444444444446E-2,6.024096385542169E-3,4.8543689320388345E-3,0,3.7679722359940507E-2,9.2018469656992091E-2,0.17626027887021808,0.19815852682145715,0.19831849653808112,0.18740239458615304,0.22964626614261652,0.11500330469266358,0.27455485353245263,0.28171557562076749,0.25274725274725274,0.27207130730050932,0.24565972222222221,0.25431637890807279,0.30013831258644535,0.2813630717718853,0.2813630717718853,null,0.18669107409890168,null,0.20315453301179692]
[null,null,"Intermediate diets concluded",null,null,6,3,15,47,220,281,226,165,180,79,33,8,6,25,172,211,232,272,170,208,176,257,227,243,225,283,282,281,233,2212,245.77777777777777,null,128.84848484848484,null,274.33333333333331]
[null,null,"After Warrant Guilty Pleas",null,null,4,3,7,30,47,74,63,85,72,30,22,20,29,18,28,35,58,65,81,93,69,71,87,88,76,83,92,102,118,804,89.333333333333329,null,43.333333333333336,null,218.25]
[null,null,"Scheduled Trials as at the end of the period",null,null,3220,3495,3732,4088,4491,4837,5074,5189,5371,5213,5255,5560,5999,6321,6945,7730,7944,7890,7941,8053,7936,8101,7868,7569,7289,7079,6711,6389,6163,4934,7026.333333333333,null,5057.606060606061,null,3497]
[]
[]
[null,"Notes\n1. These figures provide interim management information during the Coronavirus pandemic. Official Statistics with full commentary will be published by SCTS each quarter as normal. \n2. All figures in columns S and U are monthly averages except for the rows showing Trials Scheduled where figures are as at the end of the period shown.\n"]

{"sheet":"2b","index":13,"n_rows":3,"n_cols":2,"rows_kept":3,"cut":false,"hidden":true,"merged":[]}
[]
[]
[null,"Back to Index"]

{"sheet":"Business Trends Chart Data","index":14,"n_rows":27,"n_cols":9,"rows_kept":27,"cut":false,"hidden":true,"merged":[]}
[]
[null,null,null,"Business Trends Chart Data"]
["charts 2b"]
[null,null,"Conversion rate TC to ELT"]
[null,null,"2020-04-01","2020-05-01","2020-06-01","2020-07-01","2020-08-01","2020-09-01","2019/20  monthly average"]
[null,"High Court",{"$f":"'Internal analytics'!F8","v":"n/a"},{"$f":"'Internal analytics'!G8","v":"n/a"},{"$f":"'Internal analytics'!H8","v":"n/a"},{"$f":"'Internal analytics'!I8","v":1},{"$f":"'Internal analytics'!J8","v":1},{"$f":"'Internal analytics'!K8","v":0.69230769230769229},{"$f":"'Internal analytics'!AN8","v":0.61330049261083741}]
[null,"Sheriff Court - Solemn",{"$f":"'Internal analytics'!F18","v":0},{"$f":"'Internal analytics'!G18","v":0},{"$f":"'Internal analytics'!H18","v":0},{"$f":"'Internal analytics'!I18","v":0},{"$f":"'Internal analytics'!J18","v":0},{"$f":"'Internal analytics'!K18","v":0},{"$f":"'Internal analytics'!AN18","v":0.36091661362189692}]
[null,"Sheriff Court - Summary",{"$f":"'Internal analytics'!F28","v":6.2344139650872821E-3},{"$f":"'Internal analytics'!G28","v":2.4193548387096774E-2},{"$f":"'Internal analytics'!H28","v":0.15584415584415584},{"$f":"'Internal analytics'!I28","v":0.27147766323024053},{"$f":"'Internal analytics'!J28","v":0.12078531796841656},{"$f":"'Internal analytics'!K28","v":0.14161570646926294},{"$f":"'Internal analytics'!AN28","v":0.17054187434015075}]
[null,"Justice of the Peace Court - Summary",{"$f":"'Internal analytics'!F40","v":0},{"$f":"'Internal analytics'!G40","v":0},{"$f":"'Internal analytics'!H40","v":0},{"$f":"'Internal analytics'!I40","v":4.3478260869565216E-2},{"$f":"'Internal analytics'!J40","v":7.4675324675324672E-2},{"$f":"'Internal analytics'!K40","v":9.7421203438395415E-2},{"$f":"'Internal analytics'!AN40","v":0.15336447669217773}]
[]
[]
[]
[null,null,"Ratio of registered to concluded"]
[null,null,"2020-04-01","2020-05-01","2020-06-01","2020-07-01","2020-08-01","2020-09-01","2019/20  monthly average"]
[null,"High Court",{"$f":"'Internal analytics'!F11","v":9.0909090909090912E-2},{"$f":"'Internal analytics'!G11","v":0.10588235294117647},{"$f":"'Internal analytics'!H11","v":0.20289855072463769},{"$f":"'Internal analytics'!I11","v":0.50793650793650791},{"$f":"'Internal analytics'!J11","v":0.76086956521739135},{"$f":"'Internal analytics'!K11","v":0.29411764705882354},{"$f":"'Internal analytics'!AN11","v":0.78710937500000011}]
[null,"Sheriff Court - Solemn",{"$f":"'Internal analytics'!F21","v":0.63926940639269403},{"$f":"'Internal analytics'!G21","v":0.39811912225705332},{"$f":"'Internal analytics'!H21","v":0.46760563380281689},{"$f":"'Internal analytics'!I21","v":0.37259100642398285},{"$f":"'Internal analytics'!J21","v":0.57258064516129037},{"$f":"'Internal analytics'!K21","v":0.7246963562753036},{"$f":"'Internal analytics'!AN21","v":0.94552457813646373}]
[null,"Sheriff Court - Summary",{"$f":"'Internal analytics'!F31","v":0.14224137931034483},{"$f":"'Internal analytics'!G31","v":0.22913458577148138},{"$f":"'Internal analytics'!H31","v":0.2659549779531214},{"$f":"'Internal analytics'!I31","v":0.35890410958904112},{"$f":"'Internal analytics'!J31","v":0.67649494782176578},{"$f":"'Internal analytics'!K31","v":0.8128095644748079},{"$f":"'Internal analytics'!AN31","v":0.87427088105054196}]
[null,"Justice of the Peace Court - Summary",{"$f":"'Internal analytics'!F43","v":5.0150451354062184E-3},{"$f":"'Internal analytics'!G43","v":5.4945054945054944E-2},{"$f":"'Internal analytics'!H43","v":0.1955420466058764},{"$f":"'Internal analytics'!I43","v":0.25178277564454199},{"$f":"'Internal analytics'!J43","v":1.3054511278195489},{"$f":"'Internal analytics'!K43","v":1.9890829694323144},{"$f":"'Internal analytics'!AN43","v":0.91376332559109041}]
[]
[]
[]
[null,null,"Ration of trials concluded to all concluded"]
[null,null,"2020-04-01","2020-05-01","2020-06-01","2020-07-01","2020-08-01","2020-09-01","2019/20  monthly average"]
[null,"High Court",{"$f":"'Internal analytics'!F12","v":0},{"$f":"'Internal analytics'!G12","v":0},{"$f":"'Internal analytics'!H12","v":0},{"$f":"'Internal analytics'!I12","v":0.125},{"$f":"'Internal analytics'!J12","v":0.31428571428571428},{"$f":"'Internal analytics'!K12","v":0.75},{"$f":"'Internal analytics'!AN12","v":0.62655086848635233}]
[null,"Sheriff Court - Solemn",{"$f":"'Internal analytics'!F22","v":0.20714285714285716},{"$f":"'Internal analytics'!G22","v":9.4488188976377951E-2},{"$f":"'Internal analytics'!H22","v":4.8192771084337352E-2},{"$f":"'Internal analytics'!I22","v":4.0229885057471264E-2},{"$f":"'Internal analytics'!J22","v":5.6338028169014086E-2},{"$f":"'Internal analytics'!K22","v":3.6312849162011177E-2},{"$f":"'Internal analytics'!AN22","v":0.45645004849660525}]
[null,"Sheriff Court - Summary",{"$f":"'Internal analytics'!F32","v":7.6923076923076927E-2},{"$f":"'Internal analytics'!G32","v":4.5698924731182797E-2},{"$f":"'Internal analytics'!H32","v":5.4101221640488653E-2},{"$f":"'Internal analytics'!I32","v":9.1603053435114504E-2},{"$f":"'Internal analytics'!J32","v":0.29358472086190007},{"$f":"'Internal analytics'!K32","v":0.34818239125866779},{"$f":"'Internal analytics'!AN32","v":0.43839946905127852}]
[null,"Justice of the Peace Court - Summary",{"$f":"'Internal analytics'!F44","v":0.1},{"$f":"'Internal analytics'!G44","v":0.06},{"$f":"'Internal analytics'!H44","v":1.5544041450777202E-2},{"$f":"'Internal analytics'!I44","v":2.3965141612200435E-2},{"$f":"'Internal analytics'!J44","v":9.4312455003599707E-2},{"$f":"'Internal analytics'!K44","v":0.19923161361141603},{"$f":"'Internal analytics'!AN44","v":0.20315453301179692}]

{"sheet":"2","index":15,"n_rows":25,"n_cols":9,"rows_kept":25,"cut":false,"hidden":false,"merged":[[5,4,5,6],[13,4,13,6],[19,4,19,6],[1,0,1,6]]}
[null,"Back to Index"]
["Flowcharts showing showing how criminal cases move through Scotland's courts"]
[]
[]
[]
[null,null,null,null,"Continued Without Plea hearing"]
[]
[null,null,"Summary Case received and registered by the SCTS at either a Sheriff Court or a Justice of the Peace Court",null,"First Calling"," ","Intermediate Diet"," ","Trial Diet"]
[]
[]
[]
[]
[]
[null,null,"Section 76 hearing",null,"Continued First Diet"]
[]
[null,null,"Solemn Case received and registered by the SCTS at a Sheriff Court",null,"First Diet"," ","Trial Diet"," "]
[]
[]
[]
[null,null,"Section 76 hearing",null,"Continued Preliminary Hearing"]
[]
[null,null,"Solemn Case received and registered by the SCTS at the High Court of Justiciary",null,"Preliminary Hearing"," ","Trial Diet"]
[]
[]
["Back to Index"]

{"sheet":"3","index":16,"n_rows":38,"n_cols":2,"rows_kept":38,"cut":false,"hidden":false,"merged":[]}
["Back to Index"]
["Glossary"]
["Accused","A person charged with breaking the law. The term defendant is not used in Scotland"]
["Adjournment  ","An interruption to the proceedings when the court stops the hearing of the case for part of a day or for a longer period."]
["Appeal","An appeal is a re-hearing of a case by a higher court than the court which first heard the case. A re-hearing means re-consideration by the appellate court of the evidence led and the legal issues considered by the court below."]
["Average time between pleading diet and evidence led trial, where evidence led trial occurred in the period shown (weeks)","When an evidence led trial occurs, the trial date can be compared to the pleading diet date to obtain a measure of how long it has taken for the case to come to trial. Many factors can impact on the time between pleading diet and trial diet e.g. court programme capacity, adjournments due to lack of court time, witness availability, parties affected by COVID-19 etc. Where the value is marked as N/A, this means that there were no evidence led trials in the period therefore an average could not be constructed."]
["Complaint  ","A statement accusing someone of breaking the law."]
["Continued First Diet","A date on which an indictment calls in the sheriff court in solemn proceedings to determine whether the prosecutor and defence are ready to go to trial – continued from an earlier First Diet."]
["Continued Preliminary Hearing","A hearing in the High Court of Justiciary in solemn proceedings to decide if the case is ready to go for trial – continued from an earlier Preliminary Hearing. Preliminary legal or factual issues may be determined before trial at a Continued preliminary hearing."]
["Continued without Plea","A further opportunity for a summary case to call in court following no plea having been entered at first calling. "]
["Diet ","The date for a case, for instance, to hear a plea of guilty or not guilty, at an intermediate stage or for a trial."]
["Disposed","The complaint or indictment has been concluded."]
["First calling","The first time a summary case is called in court."]
["First Diet  ","A date on which an indictment calls in the sheriff court in solemn proceedings to determine whether the prosecutor and defence are ready to go to trial."]
["First Instance","The court in which the case was first heard or tried as distinct from second instance which is where a case is appealed.  "]
["Hearing ","Any part of a trial that takes place in a court."]
["Indictment  ","A document setting out the charge(s) of crimes or offences against an accused in more serious cases. A case on indictment is tried by judge sitting with a jury in the High Court (in the most serious cases), or the sheriff court. Cases tried on indictment are known as solemn proceedings."]
["Intermediate diet","A hearing in summary criminal proceedings which allows the court to check whether the case is likely to proceed on the date assigned for trial. The purpose is to minimise inconvenience to witnesses etc. if the trial is adjourned."]
["Jury","A group of lay persons chosen to decide upon issues of fact in legal proceedings. In criminal proceedings, a jury has 15 jurors."]
["Justice of the peace ","A lay magistrate who sits in the justice of the peace court."]
["Lack of Court Time","Cases that are continued to another sitting day due to the sitting day having ended. "]
["Petition ","In criminal proceedings, the Crown (the prosecutor) may begin proceedings by petition before deciding whether to prosecute on indictment or by summary complaint. Only serious cases are begun by petition."]
["Plea ","The answer the accused gives to the court at the pre-trial hearings or at the beginning of a trial when asked if he or she is guilty or not guilty."]
["Pleading Diet","Date assigned for a criminal case to call and for plea to be given, e.g., guilty or not guilty."]
["Preliminary hearing","A hearing in the High Court of Justiciary in solemn proceedings to decide if the case is ready to go for trial. Also preliminary legal or factual issues may be determined before trial at a preliminary hearing."]
["Provisional","A marking applied to statistical data to alert users that the data may be revised in the future and should not be considered as final data."]
["Second Instance","The court in which an appeal is heard as distinct from first instance which is where a case originated.  "]
["Section 76","An accused person charged with a serious offence may give notice in writing that he intends to plead guilty to an indictment under section 76 of the Criminal Procedure (Scotland) Act 1995."]
["Sheriff  ","The name for a judge in the sheriff court."]
["Sheriff and jury ","Cases heard in the sheriff court by a sheriff and jury."]
["Solemn case ","Serious criminal case before a judge and jury in the High Court or sheriff and jury in the sheriff court."]
["Summary case ","Less serious criminal case before a sheriff or justice of the peace, without a jury."]
["Sustained appeal","An appeal that is upheld or granted."]
["Trial  ","The legal action in a criminal court case."]
["Trials called","All trials that have commenced or ‘called’ in court. Some trials will conclude due to a guilty plea being entered before evidence is heard/seen; some trials will be adjourned to a later date and some trials will proceed to hear or see evidence.  "]
["Trials called where evidence was led","A subset of ‘Trials called’ where witnesses give evidence and productions are seen. "]
["Trials scheduled","The count of complaints or indictments that have a trial diet assigned but are yet to call in court."]
[null,"Back to Index"]

{"sheet":"4","index":17,"n_rows":8,"n_cols":2,"rows_kept":8,"cut":false,"hidden":false,"merged":[]}
[]
[null,"Back to Index"]
[]
[]
[]
[]
[]
[null,"  "]

{"sheet":"Sheriffdom Look up","index":18,"n_rows":102,"n_cols":7,"rows_kept":102,"cut":false,"hidden":true,"merged":[[0,6,3,9]]}
["Court Code","Court Name","Court Type","Sheriffdom Code","Sheriffdom Name",null,"This data is only for The Scottish Courts and Tribunals Service Internal use. Please go to the index tab and navigate as required."]
[9701,"ABERDEEN                  ","Sheriff",2,"Grampian Highland & Islands"]
[9702,"AIRDRIE                   ","Sheriff",5,"South Strathclyde, Dumfries & Galloway"]
[9703,"ALLOA                     ","Sheriff",6,"Tayside Central & Fife"]
[9704,"AYR                       ","Sheriff",5,"South Strathclyde, Dumfries & Galloway"]
[9705,"ARBROATH                  ","Sheriff",6,"Tayside Central & Fife"]
[9711,"BANFF                     ","Sheriff",2,"Grampian Highland & Islands"]
[9716,"CAMPBELTOWN               ","Sheriff",4,"North Strathclyde","NEW COURTS post 14-dec-09"]
[9717,"CUPAR                     ","Sheriff",6,"Tayside Central & Fife"]
[9721,"DINGWALL                  ","Sheriff",2,"Grampian Highland & Islands"]
[9722,"DORNOCH                   ","Sheriff",2,"Grampian Highland & Islands"]
[9723,"DUMBARTON                 ","Sheriff",4,"North Strathclyde"]
[9724,"DUMFRIES                  ","Sheriff",5,"South Strathclyde, Dumfries & Galloway"]
[9726,"DUNDEE                    ","Sheriff",6,"Tayside Central & Fife"]
[9727,"DUNFERMLINE               ","Sheriff",6,"Tayside Central & Fife"]
[9728,"DUNOON                    ","Sheriff",4,"North Strathclyde"]
[9729,"DUNS                      ","Sheriff",3,"Lothian & Borders"]
[9741,"EDINBURGH                 ","Sheriff",3,"Lothian & Borders"]
[9742,"ELGIN                     ","Sheriff",2,"Grampian Highland & Islands"]
[9751,"FALKIRK                   ","Sheriff",6,"Tayside Central & Fife"]
[9752,"FORFAR                    ","Sheriff",6,"Tayside Central & Fife"]
[9753,"FORT WILLIAM              ","Sheriff",2,"Grampian Highland & Islands"]
[9761,"GLASGOW                   ","Sheriff",1,"Glasgow & Strathkelvin"]
[9762,"GREENOCK                  ","Sheriff",4,"North Strathclyde"]
[9771,"HADDINGTON                ","Sheriff",3,"Lothian & Borders"]
[9772,"HAMILTON                  ","Sheriff",5,"South Strathclyde, Dumfries & Galloway"]
[9781,"INVERNESS                 ","Sheriff",2,"Grampian Highland & Islands"]
[9791,"JEDBURGH                  ","Sheriff",3,"Lothian & Borders"]
[9801,"KILMARNOCK                ","Sheriff",4,"North Strathclyde"]
[9803,"KIRKCALDY                 ","Sheriff",6,"Tayside Central & Fife"]
[9804,"KIRKCUDBRIGHT             ","Sheriff",5,"South Strathclyde, Dumfries & Galloway"]
[9805,"KIRKWALL                  ","Sheriff",2,"Grampian Highland & Islands"]
[9811,"LANARK                    ","Sheriff",5,"South Strathclyde, Dumfries & Galloway"]
[9812,"LERWICK                   ","Sheriff",2,"Grampian Highland & Islands"]
[9814,"LOCHMADDY                 ","Sheriff",2,"Grampian Highland & Islands"]
[9815,"LIVINGSTON                ","Sheriff",null,"Lothian & Borders"]
[9841,"OBAN                      ","Sheriff",4,"North Strathclyde"]
[9851,"PAISLEY                   ","Sheriff",4,"North Strathclyde"]
[9852,"PEEBLES                   ","Sheriff",3,"Lothian & Borders"]
[9853,"PERTH                     ","Sheriff",6,"Tayside Central & Fife"]
[9854,"PETERHEAD                 ","Sheriff",2,"Grampian Highland & Islands"]
[9855,"PORTREE                   ","Sheriff",2,"Grampian Highland & Islands"]
[9861,"ROTHESAY                  ","Sheriff",4,"North Strathclyde"]
[9871,"SELKIRK                   ","Sheriff",3,"Lothian & Borders"]
[9872,"STIRLING                  ","Sheriff",6,"Tayside Central & Fife"]
[9873,"STONEHAVEN                ","Sheriff",2,"Grampian Highland & Islands"]
[9874,"STORNOWAY                 ","Sheriff",2,"Grampian Highland & Islands"]
[9875,"STRANRAER                 ","Sheriff",5,"South Strathclyde, Dumfries & Galloway"]
[9881,"TAIN                      ","Sheriff",2,"Grampian Highland & Islands"]
[9891,"WICK                      ","Sheriff",2,"Grampian Highland & Islands"]
[9251,"ABERDEEN                  ","JP",2,"Grampian Highland & Islands"]
[9240,"ALLOA                     ","JP",6,"Tayside Central & Fife"]
[9245,"ANNAN                     ","JP",5,"South Strathclyde, Dumfries & Galloway"]
[9263,"ARBROATH                  ","JP",6,"Tayside Central & Fife"]
[9360,"AYR                       ","JP",5,"South Strathclyde, Dumfries & Galloway"]
[9252,"BANFF                     ","JP",2,"Grampian Highland & Islands"]
[9289,"CAMPBELTOWN               ","JP",4,"North Strathclyde"]
[9355,"AIRDRIE","JP",5,"South Strathclyde, Dumfries & Galloway"]
[9356,"CUMBERNAULD               ","JP",5,"South Strathclyde, Dumfries & Galloway"]
[9285,"CUPAR                     ","JP",6,"Tayside Central & Fife"]
[9343,"DINGWALL                  ","JP",2,"Grampian Highland & Islands"]
[9344,"DORNOCH                   ","JP",2,"Grampian Highland & Islands"]
[9376,"DUMBARTON                 ","JP",4,"North Strathclyde"]
[9246,"DUMFRIES                  ","JP",5,"South Strathclyde, Dumfries & Galloway"]
[9256,"DUNDEE                    ","JP",6,"Tayside Central & Fife"]
[9286,"DUNFERMLINE               ","JP",6,"Tayside Central & Fife"]
[9290,"DUNOON                    ","JP",4,"North Strathclyde"]
[9350,"DUNS                      ","JP",3,"Lothian & Borders"]
[9278,"EDINBURGH                 ","JP",3,"Lothian & Borders"]
[9341,"ELGIN                     ","JP",2,"Grampian Highland & Islands"]
[9282,"FALKIRK                   ","JP",6,"Tayside Central & Fife"]
[9264,"FORFAR                    ","JP",6,"Tayside Central & Fife"]
[9345,"FORT WILLIAM              ","JP",2,"Grampian Highland & Islands"]
[9295,"GLASGOW                   ","JP",1,"Glasgow & Strathkelvin"]
[9340,"GREENOCK                  ","JP",4,"North Strathclyde"]
[9270,"HADDINGTON                ","JP",3,"Lothian & Borders"]
[9366,"HAMILTON                  ","JP",5,"South Strathclyde, Dumfries & Galloway"]
[9346,"INVERNESS                 ","JP",2,"Grampian Highland & Islands"]
[9354,"IRVINE                    ","JP",4,"North Strathclyde"]
[9351,"JEDBURGH                  ","JP",3,"Lothian & Borders"]
[9261,"KILMARNOCK                ","JP",4,"North Strathclyde"]
[9287,"KIRKCALDY                 ","JP",6,"Tayside Central & Fife"]
[9247,"KIRKCUDBRIGHT             ","JP",5,"South Strathclyde, Dumfries & Galloway"]
[9367,"LANARK                    ","JP",5,"South Strathclyde, Dumfries & Galloway"]
[9380,"LIVINGSTON                ","JP",3,"Lothian & Borders"]
[9292,"LOCHGILPHEAD              ","JP",4,"North Strathclyde"]
[9357,"MOTHERWELL                ","JP",5,"South Strathclyde, Dumfries & Galloway"]
[9293,"OBAN                      ","JP",4,"North Strathclyde"]
[9342,"PAISLEY                   ","JP",4,"North Strathclyde"]
[9352,"PEEBLES                   ","JP",3,"Lothian & Borders"]
[9358,"PERTH                     ","JP",6,"Tayside Central & Fife"]
[9253,"PETERHEAD                 ","JP",2,"Grampian Highland & Islands"]
[9347,"PORTREE                   ","JP",2,"Grampian Highland & Islands"]
[9353,"SELKIRK                   ","JP",3,"Lothian & Borders"]
[9372,"STIRLING                  ","JP",6,"Tayside Central & Fife"]
[9254,"STONEHAVEN                ","JP",2,"Grampian Highland & Islands"]
[9384,"STORNOWAY                 ","JP",2,"Grampian Highland & Islands"]
[9250,"STRANRAER                 ","JP",5,"South Strathclyde, Dumfries & Galloway"]
[9348,"TAIN                      ","JP",2,"Grampian Highland & Islands"]
[9349,"WICK                      ","JP",2,"Grampian Highland & Islands"]
[1,"National ","JP",null,"National JP"]
[0,"National ","SC",null,"National SC"]